BDBM50155812 (S)-3-Quinolin-3-yl-3-{[1-(3-5,6,7,8-tetrahydro-[1,8]naphthyridin-2-yl-propionyl)-piperidine-4-carbonyl]-amino}-propionic acid::CHEMBL186627
SMILES: OC(=O)C[C@H](NC(=O)C1CCN(CC1)C(=O)CCc1ccc2CCCNc2n1)c1cnc2ccccc2c1
InChI Key: InChIKey=BSTGKAROMCRBDW-VWLOTQADSA-N
Data: 3 IC50
Activity Spreadsheet -- Enzyme Inhibition Constant Data from BindingDB
Found 3 hits for monomerid = 50155812
Trg + Lig
Ki
nM
ΔG°
kcal/mole
IC50
nM
Kd
nM
EC50/IC50
nM
koff
s-1
kon
M-1s-1
pHTemp
°C
Integrin alpha-V/beta-3
(Homo sapiens (Human))
BDBM50155812
((S)-3-Quinolin-3-yl-3-{[1-(3-5,6,7,8-tetrahydro-[1...)
Show SMILES OC(=O)C[C@H](NC(=O)C1CCN(CC1)C(=O)CCc1ccc2CCCNc2n1)c1cnc2ccccc2c1
Show InChI InChI=1S/C29H33N5O4/c35-26(10-9-23-8-7-19-5-3-13-30-28(19)32-23)34-14-11-20(12-15-34)29(38)33-25(17-27(36)37)22-16-21-4-1-2-6-24(21)31-18-22/h1-2,4,6-8,16,18,20,25H,3,5,9-15,17H2,(H,30,32)(H,33,38)(H,36,37)/t25-/m0/s1
n/an/a 2.60n/an/an/an/an/an/a
Johnson & Johnson Pharmaceutical Research & Development
Curated by ChEMBL
Assay Description
Inhibitory concentration for human vitronectin binding to immobilized alphaV-beta3 integrin
Bioorg Med Chem Lett 14: 5937-41 (2004)
Article DOI: 10.1016/j.bmcl.2004.08.067
BindingDB Entry DOI: 10.7270/Q2DZ07S6
Integrin alpha-IIb/beta-3
(Homo sapiens (Human))
BDBM50155812
((S)-3-Quinolin-3-yl-3-{[1-(3-5,6,7,8-tetrahydro-[1...)
Show SMILES OC(=O)C[C@H](NC(=O)C1CCN(CC1)C(=O)CCc1ccc2CCCNc2n1)c1cnc2ccccc2c1
Show InChI InChI=1S/C29H33N5O4/c35-26(10-9-23-8-7-19-5-3-13-30-28(19)32-23)34-14-11-20(12-15-34)29(38)33-25(17-27(36)37)22-16-21-4-1-2-6-24(21)31-18-22/h1-2,4,6-8,16,18,20,25H,3,5,9-15,17H2,(H,30,32)(H,33,38)(H,36,37)/t25-/m0/s1
n/an/a 2.90E+3n/an/an/an/an/an/a
Johnson & Johnson Pharmaceutical Research & Development
Curated by ChEMBL
Assay Description
Inhibitory concentration for biotinylated fibrinogen binding to immobilized alpha IIb beta3 integrin
Bioorg Med Chem Lett 14: 5937-41 (2004)
Article DOI: 10.1016/j.bmcl.2004.08.067
BindingDB Entry DOI: 10.7270/Q2DZ07S6
Integrin alpha-V/beta-5
(Homo sapiens (Human))
BDBM50155812
((S)-3-Quinolin-3-yl-3-{[1-(3-5,6,7,8-tetrahydro-[1...)
Show SMILES OC(=O)C[C@H](NC(=O)C1CCN(CC1)C(=O)CCc1ccc2CCCNc2n1)c1cnc2ccccc2c1
Show InChI InChI=1S/C29H33N5O4/c35-26(10-9-23-8-7-19-5-3-13-30-28(19)32-23)34-14-11-20(12-15-34)29(38)33-25(17-27(36)37)22-16-21-4-1-2-6-24(21)31-18-22/h1-2,4,6-8,16,18,20,25H,3,5,9-15,17H2,(H,30,32)(H,33,38)(H,36,37)/t25-/m0/s1
NCI pathway
Reactome pathway
n/an/a 270n/an/an/an/an/an/a
Johnson & Johnson Pharmaceutical Research & Development
Curated by ChEMBL
Assay Description
Inhibitory concentration for human vitronectin binding to immobilized alphaV-beta5 integrin
Bioorg Med Chem Lett 14: 5937-41 (2004)
Article DOI: 10.1016/j.bmcl.2004.08.067
BindingDB Entry DOI: 10.7270/Q2DZ07S6