BDBM50156424 (R)-1-{4-[5-(4-Fluoro-phenyl)-[1,2,4]oxadiazol-3-ylmethyl]-piperazin-1-yl}-3-(2-methyl-benzothiazol-5-yloxy)-propan-2-ol::CHEMBL185789
SMILES: Cc1nc2cc(OC[C@H](O)CN3CCN(Cc4noc(n4)-c4ccc(F)cc4)CC3)ccc2s1
InChI Key: InChIKey=VXOANQVYFPMBDV-LJQANCHMSA-N
Data: 1 IC50
Activity Spreadsheet -- Enzyme Inhibition Constant Data from BindingDB
Found 1 hit for monomerid = 50156424
Trg + Lig
Ki
nM
ΔG°
kcal/mole
IC50
nM
Kd
nM
EC50/IC50
nM
koff
s-1
kon
M-1s-1
pHTemp
°C
Palmitoyl-CoA oxidase
(Rattus norvegicus)
BDBM50156424
((R)-1-{4-[5-(4-Fluoro-phenyl)-[1,2,4]oxadiazol-3-y...)
Show SMILES Cc1nc2cc(OC[C@H](O)CN3CCN(Cc4noc(n4)-c4ccc(F)cc4)CC3)ccc2s1
Show InChI InChI=1S/C24H26FN5O3S/c1-16-26-21-12-20(6-7-22(21)34-16)32-15-19(31)13-29-8-10-30(11-9-29)14-23-27-24(33-28-23)17-2-4-18(25)5-3-17/h2-7,12,19,31H,8-11,13-15H2,1H3/t19-/m1/s1
Reactome pathway
n/an/a 1.53E+3n/an/an/an/an/an/a
CV Therapeutics, Inc.
Curated by ChEMBL
Assay Description
Inhibition of palmitoyl-CoA oxidation in rat heart mitochondria
Bioorg Med Chem Lett 14: 6017-21 (2004)
Article DOI: 10.1016/j.bmcl.2004.09.077
BindingDB Entry DOI: 10.7270/Q2ZS2W0R