BDBM50157312 5,3''-Dipropyl-biphenyl-2,4''-diol::5,3'-Dipropyl-biphenyl-2,4'-diol::CHEMBL330227::Magreth-2
SMILES: CCCc1ccc(O)c(c1)-c1ccc(O)c(CCC)c1
InChI Key: InChIKey=PJBHWFHBOPMXAM-UHFFFAOYSA-N
Data: 2 KI  3 IC50
Activity Spreadsheet -- Enzyme Inhibition Constant Data from BindingDB
Found 5 hits for monomerid = 50157312
Trg + Lig
Ki
nM
ΔG°
kcal/mole
IC50
nM
Kd
nM
EC50/IC50
nM
koff
s-1
kon
M-1s-1
pHTemp
°C
Cannabinoid receptor 2
(Homo sapiens (Human))
BDBM50157312
(5,3''-Dipropyl-biphenyl-2,4''-diol | 5,3'-Dipropyl...)
Show SMILES CCCc1ccc(O)c(c1)-c1ccc(O)c(CCC)c1
Show InChI InChI=1S/C18H22O2/c1-3-5-13-7-9-18(20)16(11-13)14-8-10-17(19)15(12-14)6-4-2/h7-12,19-20H,3-6H2,1-2H3
Reactome pathway
1.31E+3n/an/an/an/an/an/an/an/a
University of Bern
Assay Description
Binding assay with hCB1 and hCB2 receptors.
Chem Biol 18: 1053-64 (2011)
Article DOI: 10.1016/j.chembiol.2011.05.012
BindingDB Entry DOI: 10.7270/Q27W69PQ
Cannabinoid receptor 1
(Homo sapiens (Human))
BDBM50157312
(5,3''-Dipropyl-biphenyl-2,4''-diol | 5,3'-Dipropyl...)
Show SMILES CCCc1ccc(O)c(c1)-c1ccc(O)c(CCC)c1
Show InChI InChI=1S/C18H22O2/c1-3-5-13-7-9-18(20)16(11-13)14-8-10-17(19)15(12-14)6-4-2/h7-12,19-20H,3-6H2,1-2H3
NCI pathway
Reactome pathway
>5.00E+3n/an/an/an/an/an/an/an/a
University of Bern
Assay Description
Binding assay with hCB1 and hCB2 receptors.
Chem Biol 18: 1053-64 (2011)
Article DOI: 10.1016/j.chembiol.2011.05.012
BindingDB Entry DOI: 10.7270/Q27W69PQ
Prostaglandin G/H synthase (cyclooxygenase)
(Ovis aries (Sheep))
BDBM50157312
(5,3''-Dipropyl-biphenyl-2,4''-diol | 5,3'-Dipropyl...)
Show SMILES CCCc1ccc(O)c(c1)-c1ccc(O)c(CCC)c1
Show InChI InChI=1S/C18H22O2/c1-3-5-13-7-9-18(20)16(11-13)14-8-10-17(19)15(12-14)6-4-2/h7-12,19-20H,3-6H2,1-2H3
n/an/a 800n/an/an/an/an/an/a
Karl-Franzens-Universit£t Graz
Curated by ChEMBL
Assay Description
Inhibition of COX1 in ram seminal vesicle by enzyme immunoassay
Bioorg Med Chem 17: 4459-65 (2009)
Article DOI: 10.1016/j.bmc.2009.05.018
BindingDB Entry DOI: 10.7270/Q2SX6D9B
Prostaglandin G/H synthase (Cyclooxygenase-2)
(Ovis aries (Sheep))
BDBM50157312
(5,3''-Dipropyl-biphenyl-2,4''-diol | 5,3'-Dipropyl...)
Show SMILES CCCc1ccc(O)c(c1)-c1ccc(O)c(CCC)c1
Show InChI InChI=1S/C18H22O2/c1-3-5-13-7-9-18(20)16(11-13)14-8-10-17(19)15(12-14)6-4-2/h7-12,19-20H,3-6H2,1-2H3
n/an/a 2.10E+3n/an/an/an/an/an/a
Karl-Franzens-Universit£t Graz
Curated by ChEMBL
Assay Description
Inhibition of COX2 in sheep placental vesicle by enzyme immunoassay
Bioorg Med Chem 17: 4459-65 (2009)
Article DOI: 10.1016/j.bmc.2009.05.018
BindingDB Entry DOI: 10.7270/Q2SX6D9B
Arachidonate 5-lipoxygenase
(Homo sapiens (Human))
BDBM50157312
(5,3''-Dipropyl-biphenyl-2,4''-diol | 5,3'-Dipropyl...)
Show SMILES CCCc1ccc(O)c(c1)-c1ccc(O)c(CCC)c1
Show InChI InChI=1S/C18H22O2/c1-3-5-13-7-9-18(20)16(11-13)14-8-10-17(19)15(12-14)6-4-2/h7-12,19-20H,3-6H2,1-2H3
Reactome pathway
n/an/a 1.70E+3n/an/an/an/an/an/a
Karl-Franzens-Universit£t Graz
Curated by ChEMBL
Assay Description
Inhibition of 5LOX-mediated LTB4 formation in stimulated human polymorphonuclear leukocytes
Bioorg Med Chem 17: 4459-65 (2009)
Article DOI: 10.1016/j.bmc.2009.05.018
BindingDB Entry DOI: 10.7270/Q2SX6D9B