BDBM50165399 CHEMBL3797853
SMILES: CCc1cc(cc(C)c1OC[C@@H](O)CNC(=O)CO)-c1noc(n1)-c1cccc(CNCC(C)C)c1
InChI Key: InChIKey=DUQFGCQLXQSBPX-QHCPKHFHSA-N
Data: 2 EC50
Activity Spreadsheet -- Enzyme Inhibition Constant Data from BindingDB
Found 2 hits for monomerid = 50165399
Trg + Lig
Ki
nM
ΔG°
kcal/mole
IC50
nM
Kd
nM
EC50/IC50
nM
koff
s-1
kon
M-1s-1
pHTemp
°C
Sphingosine 1-phosphate receptor 3
(Homo sapiens (Human))
BDBM50165399
(CHEMBL3797853)
Show SMILES CCc1cc(cc(C)c1OC[C@@H](O)CNC(=O)CO)-c1noc(n1)-c1cccc(CNCC(C)C)c1 |r|
Show InChI InChI=1S/C27H36N4O5/c1-5-20-11-22(9-18(4)25(20)35-16-23(33)14-29-24(34)15-32)26-30-27(36-31-26)21-8-6-7-19(10-21)13-28-12-17(2)3/h6-11,17,23,28,32-33H,5,12-16H2,1-4H3,(H,29,34)/t23-/m0/s1
NCI pathway
Reactome pathway
n/an/an/an/a>1.00E+4n/an/an/an/a
Actelion Pharmaceuticals Ltd.
Curated by ChEMBL
Assay Description
Agonist activity at human recombinant S1PR3 expressed in CHO cell membranes assessed as [35S]GTPgammaS binding preincubated for 30 mins followed by [...
Eur J Med Chem 116: 222-238 (2016)
BindingDB Entry DOI: 10.7270/Q2ST7RRN
Sphingosine 1-phosphate receptor 1
(Homo sapiens (Human))
BDBM50165399
(CHEMBL3797853)
Show SMILES CCc1cc(cc(C)c1OC[C@@H](O)CNC(=O)CO)-c1noc(n1)-c1cccc(CNCC(C)C)c1 |r|
Show InChI InChI=1S/C27H36N4O5/c1-5-20-11-22(9-18(4)25(20)35-16-23(33)14-29-24(34)15-32)26-30-27(36-31-26)21-8-6-7-19(10-21)13-28-12-17(2)3/h6-11,17,23,28,32-33H,5,12-16H2,1-4H3,(H,29,34)/t23-/m0/s1
Reactome pathway
n/an/an/an/a 230n/an/an/an/a
Actelion Pharmaceuticals Ltd.
Curated by ChEMBL
Assay Description
Agonist activity at human recombinant S1PR1 expressed in CHO cell membranes assessed as [35S]GTPgammaS binding preincubated for 30 mins followed by [...
Eur J Med Chem 116: 222-238 (2016)
BindingDB Entry DOI: 10.7270/Q2ST7RRN