BDBM50166116 CHEMBL191614::Hexadecanoic acid (R)-4-fluoro-2-hydroxy-4-phosphono-butyl ester
SMILES: CCCCCCCCCCCCCCCC(=O)OC[C@H](O)CC(F)P(O)(O)=O
InChI Key: InChIKey=XNYDYIXHIQHKEW-MRTLOADZSA-N
Data: 1 EC50
Activity Spreadsheet -- Enzyme Inhibition Constant Data from BindingDB
Found 1 hit for monomerid = 50166116
Trg + Lig
Ki
nM
ΔG°
kcal/mole
IC50
nM
Kd
nM
EC50/IC50
nM
koff
s-1
kon
M-1s-1
pHTemp
°C
Lysophosphatidic acid receptor 3 (LPAR3)
(Homo sapiens (Human))
BDBM50166116
(CHEMBL191614 | Hexadecanoic acid (R)-4-fluoro-2-hy...)
Show SMILES CCCCCCCCCCCCCCCC(=O)OC[C@H](O)CC(F)P(O)(O)=O
Show InChI InChI=1S/C20H40FO6P/c1-2-3-4-5-6-7-8-9-10-11-12-13-14-15-20(23)27-17-18(22)16-19(21)28(24,25)26/h18-19,22H,2-17H2,1H3,(H2,24,25,26)/t18-,19?/m1/s1
n/an/an/an/a>1.00E+4n/an/an/an/a
The University of Utah
Curated by ChEMBL
Assay Description
Agonistic activity as increased intracellular calcium level by human LPA3 receptor expressed in Sf9 cells
J Med Chem 48: 3319-27 (2005)
Article DOI: 10.1021/jm049186t
BindingDB Entry DOI: 10.7270/Q2154GJ4