BDBM50166352 CHEMBL3800189
SMILES: CCC(NC(=O)c1ccc2[nH]nc(-c3ccncc3)c2c1)c1cccc(Cl)c1
InChI Key: InChIKey=SSBUZGGEUUYBCA-MYZQXJPJSA-N
Data: 2 IC50
Activity Spreadsheet -- Enzyme Inhibition Constant Data from BindingDB
Found 2 hits for monomerid = 50166352
Trg + Lig
Ki
nM
ΔG°
kcal/mole
IC50
nM
Kd
nM
EC50/IC50
nM
koff
s-1
kon
M-1s-1
pHTemp
°C
Mitogen-activated protein kinase 1
(Homo sapiens (Human))
BDBM50166352
(CHEMBL3800189)
Show SMILES CCC(NC(=O)c1ccc2[nH]nc(-c3ccncc3)c2c1)c1cccc(Cl)c1
Show InChI InChI=1S/C42H44N6O6/c43-33(23-29-15-19-31(49)20-16-29)39(51)47-37(25-27-9-3-1-4-10-27)41(53)45-35-13-7-8-14-36(35)46-42(54)38(26-28-11-5-2-6-12-28)48-40(52)34(44)24-30-17-21-32(50)22-18-30/h1-22,33-34,37-38,49-50H,23-26,43-44H2,(H,45,53)(H,46,54)(H,47,51)(H,48,52)/t33-,34-,37-,38-/m1/s1
NCI pathway
Reactome pathway
n/an/a 59n/an/an/an/an/an/a
Green Valley Research Institute
Curated by ChEMBL
Assay Description
Inhibition of human recombinant GST-tagged ERK2 expressed in Escherichia coli using ser/thr 3 Peptide as substrate preincubated for 1 hr measured aft...
Bioorg Med Chem Lett 26: 2600-4 (2016)
Article DOI: 10.1016/j.bmcl.2016.04.029
BindingDB Entry DOI: 10.7270/Q2H99731
Mitogen-activated protein kinase 3
(Homo sapiens (Human))
BDBM50166352
(CHEMBL3800189)
Show SMILES CCC(NC(=O)c1ccc2[nH]nc(-c3ccncc3)c2c1)c1cccc(Cl)c1
Show InChI InChI=1S/C42H44N6O6/c43-33(23-29-15-19-31(49)20-16-29)39(51)47-37(25-27-9-3-1-4-10-27)41(53)45-35-13-7-8-14-36(35)46-42(54)38(26-28-11-5-2-6-12-28)48-40(52)34(44)24-30-17-21-32(50)22-18-30/h1-22,33-34,37-38,49-50H,23-26,43-44H2,(H,45,53)(H,46,54)(H,47,51)(H,48,52)/t33-,34-,37-,38-/m1/s1
Reactome pathway
n/an/a 79n/an/an/an/an/an/a
Green Valley Research Institute
Curated by ChEMBL
Assay Description
Inhibition of human recombinant GST-tagged ERK1 expressed in Escherichia coli using ser/thr 3 Peptide as substrate preincubated for 1 hr measured aft...
Bioorg Med Chem Lett 26: 2600-4 (2016)
Article DOI: 10.1016/j.bmcl.2016.04.029
BindingDB Entry DOI: 10.7270/Q2H99731