BDBM50170721 2-Amino-6-naphthalen-1-yl-3H-pteridin-4-one::CHEMBL188157
SMILES: Nc1nc2ncc(nc2c(=O)[nH]1)-c1cccc2ccccc12
InChI Key: InChIKey=MQCDKNPVBDKLOD-UHFFFAOYSA-N
Data: 3 IC50
Activity Spreadsheet -- Enzyme Inhibition Constant Data from BindingDB
Found 3 hits for monomerid = 50170721
Trg + Lig
Ki
nM
ΔG°
kcal/mole
IC50
nM
Kd
nM
EC50/IC50
nM
koff
s-1
kon
M-1s-1
pHTemp
°C
Nitric oxide synthase, endothelial
(Homo sapiens (Human))
BDBM50170721
(2-Amino-6-naphthalen-1-yl-3H-pteridin-4-one | CHEM...)
Show SMILES Nc1nc2ncc(nc2c(=O)[nH]1)-c1cccc2ccccc12
Show InChI InChI=1S/C16H11N5O/c17-16-20-14-13(15(22)21-16)19-12(8-18-14)11-7-3-5-9-4-1-2-6-10(9)11/h1-8H,(H3,17,18,20,21,22)
n/an/a 3.51E+5n/an/an/an/an/an/a
Sanofi-Aventis
Curated by ChEMBL
Assay Description
Inhibitory activity against human Nitric oxide synthase-III with 2 uM H4Bip for 30 min
J Med Chem 48: 4783-92 (2005)
Article DOI: 10.1021/jm050007x
BindingDB Entry DOI: 10.7270/Q28W3CTH
Nitric oxide synthase, brain
(Homo sapiens (Human))
BDBM50170721
(2-Amino-6-naphthalen-1-yl-3H-pteridin-4-one | CHEM...)
Show SMILES Nc1nc2ncc(nc2c(=O)[nH]1)-c1cccc2ccccc12
Show InChI InChI=1S/C16H11N5O/c17-16-20-14-13(15(22)21-16)19-12(8-18-14)11-7-3-5-9-4-1-2-6-10(9)11/h1-8H,(H3,17,18,20,21,22)
Reactome pathway
n/an/a 8.51E+4n/an/an/an/an/an/a
Sanofi-Aventis
Curated by ChEMBL
Assay Description
Inhibitory activity against human Nitric oxide synthase-I with 2 uM H4Bip for 30 min
J Med Chem 48: 4783-92 (2005)
Article DOI: 10.1021/jm050007x
BindingDB Entry DOI: 10.7270/Q28W3CTH
Nitric oxide synthase, inducible
(Homo sapiens (Human))
BDBM50170721
(2-Amino-6-naphthalen-1-yl-3H-pteridin-4-one | CHEM...)
Show SMILES Nc1nc2ncc(nc2c(=O)[nH]1)-c1cccc2ccccc12
Show InChI InChI=1S/C16H11N5O/c17-16-20-14-13(15(22)21-16)19-12(8-18-14)11-7-3-5-9-4-1-2-6-10(9)11/h1-8H,(H3,17,18,20,21,22)
NCI pathway
Reactome pathway
n/an/a>5.00E+5n/an/an/an/an/an/a
Sanofi-Aventis
Curated by ChEMBL
Assay Description
Inhibitory activity against human Nitric oxide synthase-II with 2 uM H4Bip for 30 min
J Med Chem 48: 4783-92 (2005)
Article DOI: 10.1021/jm050007x
BindingDB Entry DOI: 10.7270/Q28W3CTH