null
SMILES: CCOc1cc(cnc1Nc1cccc(C)n1)-c1cnccc1C
InChI Key: InChIKey=UNZVWDNHNBIRAA-UHFFFAOYSA-N
Activity Spreadsheet -- Enzyme Inhibition Constant Data from BindingDB
Found 1 hit for monomerid = 50171051
Trg + Lig
Ki
nM
ΔG°
kcal/mole
IC50
nM
Kd
nM
EC50/IC50
nM
koff
s-1
kon
M-1s-1
pHTemp
°C
Metabotropic glutamate receptor 5
(Homo sapiens (Human))
BDBM50171051
((5-Ethoxy-4'-methyl-[3,3']bipyridinyl-6-yl)-(6-met...)
Show SMILES CCOc1cc(cnc1Nc1cccc(C)n1)-c1cnccc1C
Show InChI InChI=1S/C19H20N4O/c1-4-24-17-10-15(16-12-20-9-8-13(16)2)11-21-19(17)23-18-7-5-6-14(3)22-18/h5-12H,4H2,1-3H3,(H,21,22,23)
n/an/a 45n/an/an/an/an/an/a
Merck Research Laboratories
Curated by ChEMBL
Assay Description
In vitro potency against calcium flux in Ltk cells expressing human recombinant metabotropic glutamate receptor 5 using fluorescence detection
Bioorg Med Chem Lett 15: 4350-3 (2005)
Article DOI: 10.1016/j.bmcl.2005.06.059
BindingDB Entry DOI: 10.7270/Q2QZ29H0