null
SMILES: CCN1c2ncccc2N(C)C(=O)c2cc(CCOc3ccc4c(cccc4c3)C(O)=O)cnc12
InChI Key: InChIKey=HLOSUWDSRKERIM-UHFFFAOYSA-N
Activity Spreadsheet -- Enzyme Inhibition Constant Data from BindingDB
Found 2 hits for monomerid = 50171984
Trg + Lig
Ki
nM
ΔG°
kcal/mole
IC50
nM
Kd
nM
EC50/IC50
nM
koff
s-1
kon
M-1s-1
pHTemp
°C
Reverse transcriptase/RNaseH
(Human immunodeficiency virus 1)
BDBM50171984
(6-[2-(5-Ethyl-10-methyl-11-oxo-10,11-dihydro-5H-4,...)
Show SMILES CCN1c2ncccc2N(C)C(=O)c2cc(CCOc3ccc4c(cccc4c3)C(O)=O)cnc12
Show InChI InChI=1S/C27H24N4O4/c1-3-31-24-22(26(32)30(2)23-8-5-12-28-25(23)31)14-17(16-29-24)11-13-35-19-9-10-20-18(15-19)6-4-7-21(20)27(33)34/h4-10,12,14-16H,3,11,13H2,1-2H3,(H,33,34)
n/an/a 63n/an/an/an/a7.8n/a
Boehringer Ingelheim (Canada) Ltd.
Curated by ChEMBL
Assay Description
Inhibitory activity of compound dissolved in DMSO was determined against HIV-1 wild type reverse transcriptase (1-2 nM) by using [3H]-dGTP (71 nM) a...
J Med Chem 48: 5580-8 (2005)
Article DOI: 10.1021/jm050255t
BindingDB Entry DOI: 10.7270/Q29K49RC
Reverse transcriptase/RNaseH
(Human immunodeficiency virus 1)
BDBM50171984
(6-[2-(5-Ethyl-10-methyl-11-oxo-10,11-dihydro-5H-4,...)
Show SMILES CCN1c2ncccc2N(C)C(=O)c2cc(CCOc3ccc4c(cccc4c3)C(O)=O)cnc12
Show InChI InChI=1S/C27H24N4O4/c1-3-31-24-22(26(32)30(2)23-8-5-12-28-25(23)31)14-17(16-29-24)11-13-35-19-9-10-20-18(15-19)6-4-7-21(20)27(33)34/h4-10,12,14-16H,3,11,13H2,1-2H3,(H,33,34)
n/an/a 4.00E+3n/an/an/an/a7.8n/a
Boehringer Ingelheim (Canada) Ltd.
Curated by ChEMBL
Assay Description
Inhibitory activity of compound dissolved in DMSO was determined against HIV-1 (K103N/Y181C) mutant reverse transcriptase (1-2 nM) by using [3H]-dGTP...
J Med Chem 48: 5580-8 (2005)
Article DOI: 10.1021/jm050255t
BindingDB Entry DOI: 10.7270/Q29K49RC