BDBM50174647 1-[4,4']Bipiperidinyl-1-yl-pentadecan-1-one; hydrochloride::CHEMBL536963
SMILES: CCCCCCCCCCCCCCC(=O)N1CCC(CC1)C1CCNCC1
InChI Key: InChIKey=DTHTXHBOPJYANV-UHFFFAOYSA-N
Data: 3 EC50
Activity Spreadsheet -- Enzyme Inhibition Constant Data from BindingDB
Found 3 hits for monomerid = 50174647
Trg + Lig
Ki
nM
ΔG°
kcal/mole
IC50
nM
Kd
nM
EC50/IC50
nM
koff
s-1
kon
M-1s-1
pHTemp
°C
Guanine nucleotide-binding protein G(k), alpha-3 subunit
(Homo sapiens (Human))
BDBM50174647
(1-[4,4']Bipiperidinyl-1-yl-pentadecan-1-one; hydro...)
Show SMILES CCCCCCCCCCCCCCC(=O)N1CCC(CC1)C1CCNCC1
Show InChI InChI=1S/C25H48N2O/c1-2-3-4-5-6-7-8-9-10-11-12-13-14-25(28)27-21-17-24(18-22-27)23-15-19-26-20-16-23/h23-24,26H,2-22H2,1H3
NCI pathway
Reactome pathway
n/an/an/an/a 9.30E+3n/an/an/an/a
Universit£ di Firenze
Curated by ChEMBL
Assay Description
Concentration required to stimulate binding of [35S]GTP-gamma-S, with G alpha i3
J Med Chem 48: 6491-503 (2005)
Article DOI: 10.1021/jm050498l
BindingDB Entry DOI: 10.7270/Q2X34Z78
Guanine nucleotide-binding protein G(o), alpha subunit 1
(Homo sapiens (Human))
BDBM50174647
(1-[4,4']Bipiperidinyl-1-yl-pentadecan-1-one; hydro...)
Show SMILES CCCCCCCCCCCCCCC(=O)N1CCC(CC1)C1CCNCC1
Show InChI InChI=1S/C25H48N2O/c1-2-3-4-5-6-7-8-9-10-11-12-13-14-25(28)27-21-17-24(18-22-27)23-15-19-26-20-16-23/h23-24,26H,2-22H2,1H3
NCI pathway
Reactome pathway
n/an/an/an/a 5.60E+3n/an/an/an/a
Universit£ di Firenze
Curated by ChEMBL
Assay Description
Concentration required to stimulate binding of [35S]GTP-gamma-S, with G alpha o1
J Med Chem 48: 6491-503 (2005)
Article DOI: 10.1021/jm050498l
BindingDB Entry DOI: 10.7270/Q2X34Z78
Guanine nucleotide-binding protein G(i), alpha-1 subunit
(Homo sapiens (Human))
BDBM50174647
(1-[4,4']Bipiperidinyl-1-yl-pentadecan-1-one; hydro...)
Show SMILES CCCCCCCCCCCCCCC(=O)N1CCC(CC1)C1CCNCC1
Show InChI InChI=1S/C25H48N2O/c1-2-3-4-5-6-7-8-9-10-11-12-13-14-25(28)27-21-17-24(18-22-27)23-15-19-26-20-16-23/h23-24,26H,2-22H2,1H3
NCI pathway
Reactome pathway
n/an/an/an/a 8.60E+3n/an/an/an/a
Universit£ di Firenze
Curated by ChEMBL
Assay Description
Concentration required to stimulate binding of [35S]GTP-gamma-S, with G alpha i1
J Med Chem 48: 6491-503 (2005)
Article DOI: 10.1021/jm050498l
BindingDB Entry DOI: 10.7270/Q2X34Z78