BDBM50175458 5-(2-(trifluoromethoxy)phenyl)furan-2-carboxylic acid::5-[2-(TRIFLUOROMETHOXY)PHENYL]-2-FUROIC ACID::CHEMBL199441
SMILES: OC(=O)c1ccc(o1)-c1ccccc1OC(F)(F)F
InChI Key: InChIKey=PSLFQKRPFOCZHR-UHFFFAOYSA-N
Data: 4 IC50
PDB links: 1 PDB ID matches this monomer.
Activity Spreadsheet -- Enzyme Inhibition Constant Data from BindingDB
Found 4 hits for monomerid = 50175458
Trg + Lig
Ki
nM
ΔG°
kcal/mole
IC50
nM
Kd
nM
EC50/IC50
nM
koff
s-1
kon
M-1s-1
pHTemp
°C
Methionine Aminopeptidase (MAP)
(Escherichia coli (strain K12))
BDBM50175458
(5-(2-(trifluoromethoxy)phenyl)furan-2-carboxylic a...)
Show SMILES OC(=O)c1ccc(o1)-c1ccccc1OC(F)(F)F
Show InChI InChI=1S/C12H7F3O4/c13-12(14,15)19-9-4-2-1-3-7(9)8-5-6-10(18-8)11(16)17/h1-6H,(H,16,17)
n/an/a 1.70E+5n/an/an/an/an/an/a
Graduate School of Chinese Academy of Sciences
Curated by ChEMBL
Assay Description
Inhibitory activity against Co(II) form of Escherichia coli MetAP
Bioorg Med Chem Lett 15: 5386-91 (2005)
Article DOI: 10.1016/j.bmcl.2005.09.019
BindingDB Entry DOI: 10.7270/Q2HH6JNV
3D
3D Structure (crystal)
Methionine Aminopeptidase (MAP)
(Escherichia coli (strain K12))
BDBM50175458
(5-(2-(trifluoromethoxy)phenyl)furan-2-carboxylic a...)
Show SMILES OC(=O)c1ccc(o1)-c1ccccc1OC(F)(F)F
Show InChI InChI=1S/C12H7F3O4/c13-12(14,15)19-9-4-2-1-3-7(9)8-5-6-10(18-8)11(16)17/h1-6H,(H,16,17)
n/an/a 368n/an/an/an/an/an/a
Graduate School of Chinese Academy of Sciences
Curated by ChEMBL
Assay Description
Inhibitory activity against Mn(II) form of Escherichia coli MetAP
Bioorg Med Chem Lett 15: 5386-91 (2005)
Article DOI: 10.1016/j.bmcl.2005.09.019
BindingDB Entry DOI: 10.7270/Q2HH6JNV
3D
3D Structure (crystal)
Methionine Aminopeptidase (MAP)
(Escherichia coli (strain K12))
BDBM50175458
(5-(2-(trifluoromethoxy)phenyl)furan-2-carboxylic a...)
Show SMILES OC(=O)c1ccc(o1)-c1ccccc1OC(F)(F)F
Show InChI InChI=1S/C12H7F3O4/c13-12(14,15)19-9-4-2-1-3-7(9)8-5-6-10(18-8)11(16)17/h1-6H,(H,16,17)
n/an/a 1.91E+5n/an/an/an/an/an/a
Graduate School of Chinese Academy of Sciences
Curated by ChEMBL
Assay Description
Inhibitory activity against Fe(II) form of Escherichia coli MetAP
Bioorg Med Chem Lett 15: 5386-91 (2005)
Article DOI: 10.1016/j.bmcl.2005.09.019
BindingDB Entry DOI: 10.7270/Q2HH6JNV
3D
3D Structure (crystal)
Methionine Aminopeptidase (MAP)
(Escherichia coli (strain K12))
BDBM50175458
(5-(2-(trifluoromethoxy)phenyl)furan-2-carboxylic a...)
Show SMILES OC(=O)c1ccc(o1)-c1ccccc1OC(F)(F)F
Show InChI InChI=1S/C12H7F3O4/c13-12(14,15)19-9-4-2-1-3-7(9)8-5-6-10(18-8)11(16)17/h1-6H,(H,16,17)
n/an/a 1.97E+5n/an/an/an/an/an/a
Graduate School of Chinese Academy of Sciences
Curated by ChEMBL
Assay Description
Inhibitory activity against Ni(II) form of Escherichia coli MetAP
Bioorg Med Chem Lett 15: 5386-91 (2005)
Article DOI: 10.1016/j.bmcl.2005.09.019
BindingDB Entry DOI: 10.7270/Q2HH6JNV
3D
3D Structure (crystal)