BDBM50175836 CHEMBL200643::N-(3-(4-((1H-imidazol-4-yl)methyl)piperidin-1-yl)propyl)-3-chlorobenzenamine
SMILES: Clc1cccc(NCCCN2CCC(Cc3cnc[nH]3)CC2)c1
InChI Key: InChIKey=HGOPHNQJFNTAEL-UHFFFAOYSA-N
Data: 1 KI  1 Kd
Activity Spreadsheet -- Enzyme Inhibition Constant Data from BindingDB
Found 2 hits for monomerid = 50175836
Trg + Lig
Ki
nM
ΔG°
kcal/mole
IC50
nM
Kd
nM
EC50/IC50
nM
koff
s-1
kon
M-1s-1
pHTemp
°C
HRH3
(GUINEA PIG)
BDBM50175836
(CHEMBL200643 | N-(3-(4-((1H-imidazol-4-yl)methyl)p...)
Show SMILES Clc1cccc(NCCCN2CCC(Cc3cnc[nH]3)CC2)c1
Show InChI InChI=1S/C18H25ClN4/c19-16-3-1-4-17(12-16)21-7-2-8-23-9-5-15(6-10-23)11-18-13-20-14-22-18/h1,3-4,12-15,21H,2,5-11H2,(H,20,22)
2n/an/an/an/an/an/an/an/a
The Schering Plough Research Institute
Curated by ChEMBL
Assay Description
Displacement of [3H]-N-alpha-methylhistamine from histamine H3 receptor in guinea pig brain
Bioorg Med Chem Lett 16: 395-9 (2005)
Article DOI: 10.1016/j.bmcl.2005.09.076
BindingDB Entry DOI: 10.7270/Q29S1QK1
HRH3
(GUINEA PIG)
BDBM50175836
(CHEMBL200643 | N-(3-(4-((1H-imidazol-4-yl)methyl)p...)
Show SMILES Clc1cccc(NCCCN2CCC(Cc3cnc[nH]3)CC2)c1
Show InChI InChI=1S/C18H25ClN4/c19-16-3-1-4-17(12-16)21-7-2-8-23-9-5-15(6-10-23)11-18-13-20-14-22-18/h1,3-4,12-15,21H,2,5-11H2,(H,20,22)
n/an/an/a 3.98n/an/an/an/an/a
The Schering Plough Research Institute
Curated by ChEMBL
Assay Description
Antagonist potency against histamine H3 receptor in an electrically stimulated guinea pig ileum
Bioorg Med Chem Lett 16: 395-9 (2005)
Article DOI: 10.1016/j.bmcl.2005.09.076
BindingDB Entry DOI: 10.7270/Q29S1QK1