BDBM50177054 9-(1'-cyanomethylamino)-3-(4'-ethylphenyl)-3H-5-thia-1,3,6-triaza-fluoren-4-one::CHEMBL426190::[3-(4-Ethyl-phenyl)-4-oxo-3,4-dihydro-pyrido[3',2':4,5]thieno[3,2-d]pyrimidin-9-ylamino]-acetonitrile
SMILES: CCc1ccc(cc1)-n1cnc2c(sc3nccc(NCC#N)c23)c1=O
InChI Key: InChIKey=MYPJFABQXKXTLU-UHFFFAOYSA-N
Data: 3 IC50
Activity Spreadsheet -- Enzyme Inhibition Constant Data from BindingDB
Found 3 hits for monomerid = 50177054
Trg + Lig
Ki
nM
ΔG°
kcal/mole
IC50
nM
Kd
nM
EC50/IC50
nM
koff
s-1
kon
M-1s-1
pHTemp
°C
Metabotropic glutamate receptor 1
(Homo sapiens (Human))
BDBM50177054
(9-(1'-cyanomethylamino)-3-(4'-ethylphenyl)-3H-5-th...)
Show SMILES CCc1ccc(cc1)-n1cnc2c(sc3nccc(NCC#N)c23)c1=O
Show InChI InChI=1S/C19H15N5OS/c1-2-12-3-5-13(6-4-12)24-11-23-16-15-14(21-10-8-20)7-9-22-18(15)26-17(16)19(24)25/h3-7,9,11H,2,10H2,1H3,(H,21,22)
n/an/a 49n/an/an/an/an/an/a
Abbott Laboratories
Curated by ChEMBL
Assay Description
Antagonist activity at human mGluR1 expressed in 1321N1 cells assessed as effect on L-glutamate-induced calcium mobilization
J Med Chem 48: 7374-88 (2005)
Article DOI: 10.1021/jm0504407
BindingDB Entry DOI: 10.7270/Q27P8XX0
Metabotropic glutamate receptor
(RAT)
BDBM50177054
(9-(1'-cyanomethylamino)-3-(4'-ethylphenyl)-3H-5-th...)
Show SMILES CCc1ccc(cc1)-n1cnc2c(sc3nccc(NCC#N)c23)c1=O
Show InChI InChI=1S/C19H15N5OS/c1-2-12-3-5-13(6-4-12)24-11-23-16-15-14(21-10-8-20)7-9-22-18(15)26-17(16)19(24)25/h3-7,9,11H,2,10H2,1H3,(H,21,22)
n/an/a 43n/an/an/an/an/an/a
Biocampus
Curated by ChEMBL
Assay Description
Inhibition of rat mGluR1
Eur J Med Chem 43: 1025-34 (2008)
Article DOI: 10.1016/j.ejmech.2007.06.024
BindingDB Entry DOI: 10.7270/Q2V987VM
Metabotropic glutamate receptor 5
(Homo sapiens (Human))
BDBM50177054
(9-(1'-cyanomethylamino)-3-(4'-ethylphenyl)-3H-5-th...)
Show SMILES CCc1ccc(cc1)-n1cnc2c(sc3nccc(NCC#N)c23)c1=O
Show InChI InChI=1S/C19H15N5OS/c1-2-12-3-5-13(6-4-12)24-11-23-16-15-14(21-10-8-20)7-9-22-18(15)26-17(16)19(24)25/h3-7,9,11H,2,10H2,1H3,(H,21,22)
n/an/a 2.10E+3n/an/an/an/an/an/a
Abbott Laboratories
Curated by ChEMBL
Assay Description
Antagonist activity at human mGluR5 expressed in 1321N1 cells assessed as effect on L-glutamate-induced calcium mobilization
J Med Chem 48: 7374-88 (2005)
Article DOI: 10.1021/jm0504407
BindingDB Entry DOI: 10.7270/Q27P8XX0