BDBM50177810 2-{[6-Methoxy-7-(2-methoxyethoxy)quinazolin-4-yl]amino}-5-[(3-phenylprop-2-yn-1-yl)oxy]benzo-1,4-quinone::CHEMBL372606
SMILES: COCCOc1cc2ncnc(N=C3CC(=O)C(OCC#Cc4ccccc4)=CC3=O)c2cc1OC
InChI Key: InChIKey=TWUSXZPLMMKGAY-UHFFFAOYSA-N
Data: 3 IC50
Activity Spreadsheet -- Enzyme Inhibition Constant Data from BindingDB
Found 3 hits for monomerid = 50177810
Trg + Lig
Ki
nM
ΔG°
kcal/mole
IC50
nM
Kd
nM
EC50/IC50
nM
koff
s-1
kon
M-1s-1
pHTemp
°C
Vascular endothelial growth factor receptor 2
(Homo sapiens (Human))
BDBM50177810
(2-{[6-Methoxy-7-(2-methoxyethoxy)quinazolin-4-yl]a...)
Show SMILES COCCOc1cc2ncnc(N=C3CC(=O)C(OCC#Cc4ccccc4)=CC3=O)c2cc1OC |w:12.11,c:28|
Show InChI InChI=1S/C27H23N3O6/c1-33-11-12-36-26-15-20-19(13-25(26)34-2)27(29-17-28-20)30-21-14-23(32)24(16-22(21)31)35-10-6-9-18-7-4-3-5-8-18/h3-5,7-8,13,15-17H,10-12,14H2,1-2H3
NCI pathway
Reactome pathway
n/an/a 3.40n/an/an/an/an/an/a
Wyeth Research
Curated by ChEMBL
Assay Description
Inhibition of poly(Glu4-Tyr)peptide phosphorylation by recombinant VEGFR2 at 10 uM ATP
J Med Chem 48: 7560-81 (2005)
Article DOI: 10.1021/jm050559f
BindingDB Entry DOI: 10.7270/Q2028R3S
Vascular endothelial growth factor receptor 2
(Homo sapiens (Human))
BDBM50177810
(2-{[6-Methoxy-7-(2-methoxyethoxy)quinazolin-4-yl]a...)
Show SMILES COCCOc1cc2ncnc(N=C3CC(=O)C(OCC#Cc4ccccc4)=CC3=O)c2cc1OC |w:12.11,c:28|
Show InChI InChI=1S/C27H23N3O6/c1-33-11-12-36-26-15-20-19(13-25(26)34-2)27(29-17-28-20)30-21-14-23(32)24(16-22(21)31)35-10-6-9-18-7-4-3-5-8-18/h3-5,7-8,13,15-17H,10-12,14H2,1-2H3
NCI pathway
Reactome pathway
n/an/a 8.10n/an/an/an/an/an/a
Wyeth Research
Curated by ChEMBL
Assay Description
Inhibition of poly(Glu4-Tyr)peptide phosphorylation by recombinant VEGFR2 at 10 uM ATP
J Med Chem 48: 7560-81 (2005)
Article DOI: 10.1021/jm050559f
BindingDB Entry DOI: 10.7270/Q2028R3S
Vascular endothelial growth factor receptor 2
(Homo sapiens (Human))
BDBM50177810
(2-{[6-Methoxy-7-(2-methoxyethoxy)quinazolin-4-yl]a...)
Show SMILES COCCOc1cc2ncnc(N=C3CC(=O)C(OCC#Cc4ccccc4)=CC3=O)c2cc1OC |w:12.11,c:28|
Show InChI InChI=1S/C27H23N3O6/c1-33-11-12-36-26-15-20-19(13-25(26)34-2)27(29-17-28-20)30-21-14-23(32)24(16-22(21)31)35-10-6-9-18-7-4-3-5-8-18/h3-5,7-8,13,15-17H,10-12,14H2,1-2H3
NCI pathway
Reactome pathway
n/an/a 17n/an/an/an/an/an/a
Wyeth Research
Curated by ChEMBL
Assay Description
Inhibition of poly(Glu4-Tyr)peptide phosphorylation by recombinant VEGFR2 at 10 uM ATP and in presence of 5% mouse plasma
J Med Chem 48: 7560-81 (2005)
Article DOI: 10.1021/jm050559f
BindingDB Entry DOI: 10.7270/Q2028R3S