BDBM50178693 CHEMBL3814330
SMILES: Fc1cc(cc(c1)[C@](Cc1ccccc1)(NC(=O)c1ccc(F)c(c1)C(F)(F)F)c1ccc(Cl)cn1)C(F)(F)F
InChI Key: InChIKey=MFYYOSRTEYGZDL-SANMLTNESA-N
Data: 2 IC50
Activity Spreadsheet -- Enzyme Inhibition Constant Data from BindingDB
Found 2 hits for monomerid = 50178693
Trg + Lig
Ki
nM
ΔG°
kcal/mole
IC50
nM
Kd
nM
EC50/IC50
nM
koff
s-1
kon
M-1s-1
pHTemp
°C
Cholesteryl ester transfer protein
(Homo sapiens (Human))
BDBM50178693
(CHEMBL3814330)
Show SMILES Fc1cc(cc(c1)[C@](Cc1ccccc1)(NC(=O)c1ccc(F)c(c1)C(F)(F)F)c1ccc(Cl)cn1)C(F)(F)F |r|
Show InChI InChI=1S/C28H17ClF8N2O/c29-20-7-9-24(38-15-20)26(14-16-4-2-1-3-5-16,18-11-19(27(32,33)34)13-21(30)12-18)39-25(40)17-6-8-23(31)22(10-17)28(35,36)37/h1-13,15H,14H2,(H,39,40)/t26-/m0/s1
Reactome pathway
n/an/a 7.00E+3n/an/an/an/an/an/a
Bristol-Myers Squibb Pharmaceutical Research Institute
Curated by ChEMBL
Assay Description
Inhibition of CETP in human whole plasma assessed as reduction in [3H]cholesteryl ester transfer from [3H]CE-HDL to LDL/VLDL
Bioorg Med Chem Lett 26: 3278-3281 (2016)
BindingDB Entry DOI: 10.7270/Q2TQ63FN
Cholesteryl ester transfer protein
(Homo sapiens (Human))
BDBM50178693
(CHEMBL3814330)
Show SMILES Fc1cc(cc(c1)[C@](Cc1ccccc1)(NC(=O)c1ccc(F)c(c1)C(F)(F)F)c1ccc(Cl)cn1)C(F)(F)F |r|
Show InChI InChI=1S/C28H17ClF8N2O/c29-20-7-9-24(38-15-20)26(14-16-4-2-1-3-5-16,18-11-19(27(32,33)34)13-21(30)12-18)39-25(40)17-6-8-23(31)22(10-17)28(35,36)37/h1-13,15H,14H2,(H,39,40)/t26-/m0/s1
Reactome pathway
n/an/a 52n/an/an/an/an/an/a
Bristol-Myers Squibb Pharmaceutical Research Institute
Curated by ChEMBL
Assay Description
Inhibition of human recombinant CETP assessed as reduction in [3H]cholesteryl ester transfer from [3H]CE-HDL to biotinylated LDL by scintillation pro...
Bioorg Med Chem Lett 26: 3278-3281 (2016)
BindingDB Entry DOI: 10.7270/Q2TQ63FN