BDBM50179940 2-(5-acetyl-2-bromo-5,6,11,12-tetrahydro-dibenzo[b,f]azocin-8-yl)-benzoic acid methyl ester::CHEMBL204882
SMILES: COC(=O)c1ccccc1-c1ccc2CCc3cc(Br)ccc3N(Cc2c1)C(C)=O
InChI Key: InChIKey=APBUQJIFECIIKA-UHFFFAOYSA-N
Data: 2 IC50
Activity Spreadsheet -- Enzyme Inhibition Constant Data from BindingDB
Found 2 hits for monomerid = 50179940
Trg + Lig
Ki
nM
ΔG°
kcal/mole
IC50
nM
Kd
nM
EC50/IC50
nM
koff
s-1
kon
M-1s-1
pHTemp
°C
17-beta-hydroxysteroid dehydrogenase type 3
(Homo sapiens (Human))
BDBM50179940
(2-(5-acetyl-2-bromo-5,6,11,12-tetrahydro-dibenzo[b...)
Show SMILES COC(=O)c1ccccc1-c1ccc2CCc3cc(Br)ccc3N(Cc2c1)C(C)=O
Show InChI InChI=1S/C25H22BrNO3/c1-16(28)27-15-20-13-18(22-5-3-4-6-23(22)25(29)30-2)9-7-17(20)8-10-19-14-21(26)11-12-24(19)27/h3-7,9,11-14H,8,10,15H2,1-2H3
Reactome pathway
n/an/a 0.700n/an/an/an/an/an/a
Bristol-Myers Squibb Pharmaceutical Research Institute
Curated by ChEMBL
Assay Description
Inhibition of 17beta-HSD3
Bioorg Med Chem Lett 16: 1532-6 (2006)
Article DOI: 10.1016/j.bmcl.2005.12.039
BindingDB Entry DOI: 10.7270/Q2CV4HBV
17-beta-hydroxysteroid dehydrogenase type 3
(Homo sapiens (Human))
BDBM50179940
(2-(5-acetyl-2-bromo-5,6,11,12-tetrahydro-dibenzo[b...)
Show SMILES COC(=O)c1ccccc1-c1ccc2CCc3cc(Br)ccc3N(Cc2c1)C(C)=O
Show InChI InChI=1S/C25H22BrNO3/c1-16(28)27-15-20-13-18(22-5-3-4-6-23(22)25(29)30-2)9-7-17(20)8-10-19-14-21(26)11-12-24(19)27/h3-7,9,11-14H,8,10,15H2,1-2H3
Reactome pathway
n/an/a 1n/an/an/an/an/an/a
Bristol-Myers Squibb Pharmaceutical Research Institute
Curated by ChEMBL
Assay Description
Inhibition of 17beta-HSD3 by SEAP assay
Bioorg Med Chem Lett 16: 1532-6 (2006)
Article DOI: 10.1016/j.bmcl.2005.12.039
BindingDB Entry DOI: 10.7270/Q2CV4HBV