null
SMILES: COc1cc(Nc2ncc3ccn(-c4ccc(SC)cc4)c3n2)cc(OC)c1OC
InChI Key: InChIKey=SHYYSVDQYMSMQO-UHFFFAOYSA-N
Activity Spreadsheet -- Enzyme Inhibition Constant Data from BindingDB
Found 1 hit for monomerid = 50184006
Trg + Lig
Ki
nM
ΔG°
kcal/mole
IC50
nM
Kd
nM
EC50/IC50
nM
koff
s-1
kon
M-1s-1
pHTemp
°C
Focal adhesion kinase 1
(Homo sapiens (Human))
BDBM50184006
(7-(4-(methylthio)phenyl)-N-(3,4,5-trimethoxyphenyl...)
Show SMILES COc1cc(Nc2ncc3ccn(-c4ccc(SC)cc4)c3n2)cc(OC)c1OC
Show InChI InChI=1S/C22H22N4O3S/c1-27-18-11-15(12-19(28-2)20(18)29-3)24-22-23-13-14-9-10-26(21(14)25-22)16-5-7-17(30-4)8-6-16/h5-13H,1-4H3,(H,23,24,25)
NCI pathway
Reactome pathway
n/an/a 831n/an/an/an/an/an/a
Genomics Institute of the Novartis Research Foundation (GNF)
Curated by ChEMBL
Assay Description
Inhibition of FAK
Bioorg Med Chem Lett 16: 2689-92 (2006)
Article DOI: 10.1016/j.bmcl.2006.02.032
BindingDB Entry DOI: 10.7270/Q2NK3DN0