BDBM50185031 CHEMBL203189::N-oleoyl-N-(2-hydroxyethyl)hydroxylamine
SMILES: CCCCCCCC\C=C/CCCCCCCC(=O)N(O)CCO
InChI Key: InChIKey=QINGXEUKNRODNT-KTKRTIGZSA-N
Data: 2 KI  1 EC50
Activity Spreadsheet -- Enzyme Inhibition Constant Data from BindingDB
Found 3 hits for monomerid = 50185031
Trg + Lig
Ki
nM
ΔG°
kcal/mole
IC50
nM
Kd
nM
EC50/IC50
nM
koff
s-1
kon
M-1s-1
pHTemp
°C
Cannabinoid receptor 2
(Homo sapiens (Human))
BDBM50185031
(CHEMBL203189 | N-oleoyl-N-(2-hydroxyethyl)hydroxyl...)
Show SMILES CCCCCCCC\C=C/CCCCCCCC(=O)N(O)CCO
Show InChI InChI=1S/C20H39NO3/c1-2-3-4-5-6-7-8-9-10-11-12-13-14-15-16-17-20(23)21(24)18-19-22/h9-10,22,24H,2-8,11-19H2,1H3/b10-9-
Reactome pathway
5.40E+3n/an/an/an/an/an/an/an/a
Farmaceutiche
Curated by ChEMBL
Assay Description
Binding affinity to human recombinant CB2 receptor expressed in COS cells
J Med Chem 49: 2333-8 (2006)
Article DOI: 10.1021/jm051240y
BindingDB Entry DOI: 10.7270/Q2862G15
Cannabinoid receptor 1
(Homo sapiens (Human))
BDBM50185031
(CHEMBL203189 | N-oleoyl-N-(2-hydroxyethyl)hydroxyl...)
Show SMILES CCCCCCCC\C=C/CCCCCCCC(=O)N(O)CCO
Show InChI InChI=1S/C20H39NO3/c1-2-3-4-5-6-7-8-9-10-11-12-13-14-15-16-17-20(23)21(24)18-19-22/h9-10,22,24H,2-8,11-19H2,1H3/b10-9-
NCI pathway
Reactome pathway
>1.00E+4n/an/an/an/an/an/an/an/a
Farmaceutiche
Curated by ChEMBL
Assay Description
Binding affinity to human recombinant CB1 receptor expressed in COS cells
J Med Chem 49: 2333-8 (2006)
Article DOI: 10.1021/jm051240y
BindingDB Entry DOI: 10.7270/Q2862G15
Transient receptor potential cation channel subfamily V member 1
(Homo sapiens (Human))
BDBM50185031
(CHEMBL203189 | N-oleoyl-N-(2-hydroxyethyl)hydroxyl...)
Show SMILES CCCCCCCC\C=C/CCCCCCCC(=O)N(O)CCO
Show InChI InChI=1S/C20H39NO3/c1-2-3-4-5-6-7-8-9-10-11-12-13-14-15-16-17-20(23)21(24)18-19-22/h9-10,22,24H,2-8,11-19H2,1H3/b10-9-
Reactome pathway
n/an/an/an/a 400n/an/an/an/a
Farmaceutiche
Curated by ChEMBL
Assay Description
Agonist activity on human recombinant TRPV1-mediated enhancement of intracellular calcium concentration in HEK293 cells
J Med Chem 49: 2333-8 (2006)
Article DOI: 10.1021/jm051240y
BindingDB Entry DOI: 10.7270/Q2862G15