BDBM50186030 (S)-cyclopentyl 6-methyl-4-(4-nitrophenyl)-2-oxo-1,2,3,4-tetrahydropyrimidine-5-carboxylate::CHEMBL211941
SMILES: CC1=NC(=O)N[C@H](C1C(=O)OC1CCCC1)c1ccc(cc1)[N+]([O-])=O
InChI Key: InChIKey=DUTOIEMVMPQCQJ-LOACHALJSA-N
Data: 1 IC50
Activity Spreadsheet -- Enzyme Inhibition Constant Data from BindingDB
Found 1 hit for monomerid = 50186030
Trg + Lig
Ki
nM
ΔG°
kcal/mole
IC50
nM
Kd
nM
EC50/IC50
nM
koff
s-1
kon
M-1s-1
pHTemp
°C
Fatty acid transport protein 4
(Homo sapiens (Human))
BDBM50186030
((S)-cyclopentyl 6-methyl-4-(4-nitrophenyl)-2-oxo-1...)
Show SMILES CC1=NC(=O)N[C@H](C1C(=O)OC1CCCC1)c1ccc(cc1)[N+]([O-])=O |t:1|
Show InChI InChI=1S/C17H19N3O5/c1-10-14(16(21)25-13-4-2-3-5-13)15(19-17(22)18-10)11-6-8-12(9-7-11)20(23)24/h6-9,13-15H,2-5H2,1H3,(H,19,22)/t14?,15-/m0/s1
Reactome pathway
n/an/a 200n/an/an/an/an/an/a
Millennium Pharmaceuticals, Inc.
Curated by ChEMBL
Assay Description
Inhibition of human FATP4-mediated 12-BODIPY-lauric acid uptake in HEK293 cells
Bioorg Med Chem Lett 16: 3504-9 (2006)
Article DOI: 10.1016/j.bmcl.2006.03.102
BindingDB Entry DOI: 10.7270/Q2K9373C