BDBM50187688 CHEMBL3828650::US10913745, Example 1.11
SMILES: [H][C@]12CN(C[C@]1([H])CN(C2)C(=O)c1ccc(c(F)c1)S(N)(=O)=O)C(=O)OCc1ccc(OC(F)(F)F)cc1
InChI Key: InChIKey=PCBOWMZAEDDKNH-HOTGVXAUSA-N
Data: 2 IC50
Activity Spreadsheet -- Enzyme Inhibition Constant Data from BindingDB
Found 2 hits for monomerid = 50187688
Trg + Lig
Ki
nM
ΔG°
kcal/mole
IC50
nM
Kd
nM
EC50/IC50
nM
koff
s-1
kon
M-1s-1
pHTemp
°C
Ataxin-1
(Homo sapiens (Human))
BDBM50187688
(CHEMBL3828650 | US10913745, Example 1.11)
Show SMILES [H][C@]12CN(C[C@]1([H])CN(C2)C(=O)c1ccc(c(F)c1)S(N)(=O)=O)C(=O)OCc1ccc(OC(F)(F)F)cc1 |r|
Show InChI InChI=1S/C22H21F4N3O6S/c23-18-7-14(3-6-19(18)36(27,32)33)20(30)28-8-15-10-29(11-16(15)9-28)21(31)34-12-13-1-4-17(5-2-13)35-22(24,25)26/h1-7,15-16H,8-12H2,(H2,27,32,33)/t15-,16-/m0/s1
US Patent
n/an/a 1n/an/an/an/an/an/a
Hoffmann-La Roche Inc.
US Patent
Assay Description
Assay buffer (50 mM Tris-HCl, 140 mM NaCl, 5 mM KCl, 1 mM CaCl2, 1 mM MgCl2, 0.01% Triton-X-100, pH 8.0;ATX solution: ATX (human His-tagged) stock so...
US Patent US10913745 (2021)
Ectonucleotide pyrophosphatase/phosphodiesterase family member 2
(Homo sapiens (Human))
BDBM50187688
(CHEMBL3828650 | US10913745, Example 1.11)
Show SMILES [H][C@]12CN(C[C@]1([H])CN(C2)C(=O)c1ccc(c(F)c1)S(N)(=O)=O)C(=O)OCc1ccc(OC(F)(F)F)cc1 |r|
Show InChI InChI=1S/C22H21F4N3O6S/c23-18-7-14(3-6-19(18)36(27,32)33)20(30)28-8-15-10-29(11-16(15)9-28)21(31)34-12-13-1-4-17(5-2-13)35-22(24,25)26/h1-7,15-16H,8-12H2,(H2,27,32,33)/t15-,16-/m0/s1
n/an/a 1n/an/an/an/an/an/a
University of Strathclyde
Curated by ChEMBL
Assay Description
Inhibition of recombinant human C-terminal His-tagged ATX expressed in HEK293E cells using lysophosphatidylcholine as substrate preincubated with enz...
J Med Chem 59: 5604-21 (2016)
BindingDB Entry DOI: 10.7270/Q2BZ681D