BDBM50190696 (2S)-3'-(5-bromothien-2-yl)-2'H-spiro[4-azabicyclo[2.2.2]octane-2,5'-[1,3]oxazolidin]-2'-one::CHEMBL213024
SMILES: Brc1ccc(s1)N1C[C@]2(CN3CCC2CC3)OC1=O
InChI Key: InChIKey=IOQWLUAQJKWRCD-ZDUSSCGKSA-N
Data: 1 KI  1 IC50
Activity Spreadsheet -- Enzyme Inhibition Constant Data from BindingDB
Found 2 hits for monomerid = 50190696
Trg + Lig
Ki
nM
ΔG°
kcal/mole
IC50
nM
Kd
nM
EC50/IC50
nM
koff
s-1
kon
M-1s-1
pHTemp
°C
Neuronal acetylcholine receptor
(Rattus norvegicus (Rat))
BDBM50190696
((2S)-3'-(5-bromothien-2-yl)-2'H-spiro[4-azabicyclo...)
Show SMILES Brc1ccc(s1)N1C[C@]2(CN3CCC2CC3)OC1=O |wU:8.18,TLB:7:8:12.11:14.15,THB:16:8:12.11:14.15,(5.67,-5.62,;4.7,-4.42,;3.16,-4.5,;2.61,-3.06,;3.81,-2.09,;5.1,-2.93,;3.74,-.55,;2.45,.29,;2.85,1.77,;2.57,3.17,;1.22,3.79,;-.25,3.14,;-.05,1.76,;1.49,2.42,;1.74,4.32,;1.29,5.43,;4.39,1.85,;4.93,.41,;6.42,.01,)|
Show InChI InChI=1S/C13H15BrN2O2S/c14-10-1-2-11(19-10)16-8-13(18-12(16)17)7-15-5-3-9(13)4-6-15/h1-2,9H,3-8H2/t13-/m0/s1
Reactome pathway
4n/an/an/an/an/an/an/an/a
Mitsubishi Pharma Corporation
Curated by ChEMBL
Assay Description
Displacement of [125I]alpha-BTX from alpha-7 nAChR in rat hippocampus membrane
J Med Chem 49: 4374-83 (2006)
Article DOI: 10.1021/jm060249c
BindingDB Entry DOI: 10.7270/Q2BR8T08
Cytochrome P450 2D6
(Homo sapiens (Human))
BDBM50190696
((2S)-3'-(5-bromothien-2-yl)-2'H-spiro[4-azabicyclo...)
Show SMILES Brc1ccc(s1)N1C[C@]2(CN3CCC2CC3)OC1=O |wU:8.18,TLB:7:8:12.11:14.15,THB:16:8:12.11:14.15,(5.67,-5.62,;4.7,-4.42,;3.16,-4.5,;2.61,-3.06,;3.81,-2.09,;5.1,-2.93,;3.74,-.55,;2.45,.29,;2.85,1.77,;2.57,3.17,;1.22,3.79,;-.25,3.14,;-.05,1.76,;1.49,2.42,;1.74,4.32,;1.29,5.43,;4.39,1.85,;4.93,.41,;6.42,.01,)|
Show InChI InChI=1S/C13H15BrN2O2S/c14-10-1-2-11(19-10)16-8-13(18-12(16)17)7-15-5-3-9(13)4-6-15/h1-2,9H,3-8H2/t13-/m0/s1
n/an/a 9.00E+3n/an/an/an/an/an/a
Mitsubishi Pharma Corporation
Curated by ChEMBL
Assay Description
Inhibition of CYP2D6
J Med Chem 49: 4374-83 (2006)
Article DOI: 10.1021/jm060249c
BindingDB Entry DOI: 10.7270/Q2BR8T08