BDBM50191593 CHEMBL3967962
SMILES: O=C(Nc1cc2c(Nc3ccc(Cc4ccccn4)cc3)ncnc2cn1)\C=C\CN1CCCC1
InChI Key: InChIKey=JLWZRGNJHZVVKD-FNORWQNLSA-N
Data: 5 IC50
Activity Spreadsheet -- Enzyme Inhibition Constant Data from BindingDB
Found 5 hits for monomerid = 50191593
Trg + Lig
Ki
nM
ΔG°
kcal/mole
IC50
nM
Kd
nM
EC50/IC50
nM
koff
s-1
kon
M-1s-1
pHTemp
°C
Epidermal growth factor receptor
(Homo sapiens (Human))
BDBM50191593
(CHEMBL3967962)
Show SMILES O=C(Nc1cc2c(Nc3ccc(Cc4ccccn4)cc3)ncnc2cn1)\C=C\CN1CCCC1
Show InChI InChI=1S/C27H27N7O/c35-26(7-5-15-34-13-3-4-14-34)33-25-17-23-24(18-29-25)30-19-31-27(23)32-21-10-8-20(9-11-21)16-22-6-1-2-12-28-22/h1-2,5-12,17-19H,3-4,13-16H2,(H,29,33,35)(H,30,31,32)/b7-5+
n/an/a 10n/an/an/an/an/an/a
University of Auckland
Curated by ChEMBL
Assay Description
Irreversible inhibition of full length human ERBB1 autophosphorylation transfected in EGF-stimulated mouse NIH/3T3 cells incubated for 2 hrs followed...
J Med Chem 59: 8103-24 (2016)
BindingDB Entry DOI: 10.7270/Q2FF3VB3
Tyrosine-protein kinase JAK3
(Homo sapiens (Human))
BDBM50191593
(CHEMBL3967962)
Show SMILES O=C(Nc1cc2c(Nc3ccc(Cc4ccccn4)cc3)ncnc2cn1)\C=C\CN1CCCC1
Show InChI InChI=1S/C27H27N7O/c35-26(7-5-15-34-13-3-4-14-34)33-25-17-23-24(18-29-25)30-19-31-27(23)32-21-10-8-20(9-11-21)16-22-6-1-2-12-28-22/h1-2,5-12,17-19H,3-4,13-16H2,(H,29,33,35)(H,30,31,32)/b7-5+
Reactome pathway
n/an/a>1.00E+4n/an/an/an/an/an/a
University of Auckland
Curated by ChEMBL
Assay Description
Irreversible inhibition of human recombinant GST-tagged JAK3 expressed in baculovirus infected Sf9 insect cells assessed as reduction in polyglutamic...
J Med Chem 59: 8103-24 (2016)
BindingDB Entry DOI: 10.7270/Q2FF3VB3
Receptor tyrosine-protein kinase erbB-2
(Homo sapiens (Human))
BDBM50191593
(CHEMBL3967962)
Show SMILES O=C(Nc1cc2c(Nc3ccc(Cc4ccccn4)cc3)ncnc2cn1)\C=C\CN1CCCC1
Show InChI InChI=1S/C27H27N7O/c35-26(7-5-15-34-13-3-4-14-34)33-25-17-23-24(18-29-25)30-19-31-27(23)32-21-10-8-20(9-11-21)16-22-6-1-2-12-28-22/h1-2,5-12,17-19H,3-4,13-16H2,(H,29,33,35)(H,30,31,32)/b7-5+
n/an/a 17n/an/an/an/an/an/a
University of Auckland
Curated by ChEMBL
Assay Description
Irreversible inhibition of GST-tagged ERBB2 (unknown origin) (Ile-675 to Val-1256 residues) expressed in baculovirus infected Sf9 insect cells assess...
J Med Chem 59: 8103-24 (2016)
BindingDB Entry DOI: 10.7270/Q2FF3VB3
Receptor protein-tyrosine kinase erbB-4
(Homo sapiens (Human))
BDBM50191593
(CHEMBL3967962)
Show SMILES O=C(Nc1cc2c(Nc3ccc(Cc4ccccn4)cc3)ncnc2cn1)\C=C\CN1CCCC1
Show InChI InChI=1S/C27H27N7O/c35-26(7-5-15-34-13-3-4-14-34)33-25-17-23-24(18-29-25)30-19-31-27(23)32-21-10-8-20(9-11-21)16-22-6-1-2-12-28-22/h1-2,5-12,17-19H,3-4,13-16H2,(H,29,33,35)(H,30,31,32)/b7-5+
n/an/a 4n/an/an/an/an/an/a
University of Auckland
Curated by ChEMBL
Assay Description
Irreversible inhibition of GST-tagged ERBB4 (unknown origin) (Gly-259 to Gly-690 residues) expressed in baculovirus infected Sf9 insect cells assesse...
J Med Chem 59: 8103-24 (2016)
BindingDB Entry DOI: 10.7270/Q2FF3VB3
Epidermal growth factor receptor
(Homo sapiens (Human))
BDBM50191593
(CHEMBL3967962)
Show SMILES O=C(Nc1cc2c(Nc3ccc(Cc4ccccn4)cc3)ncnc2cn1)\C=C\CN1CCCC1
Show InChI InChI=1S/C27H27N7O/c35-26(7-5-15-34-13-3-4-14-34)33-25-17-23-24(18-29-25)30-19-31-27(23)32-21-10-8-20(9-11-21)16-22-6-1-2-12-28-22/h1-2,5-12,17-19H,3-4,13-16H2,(H,29,33,35)(H,30,31,32)/b7-5+
n/an/a 405n/an/an/an/an/an/a
University of Auckland
Curated by ChEMBL
Assay Description
Irreversible inhibition of GST-tagged ERBB1 (unknown origin) (Met-668 to Ala-1211 residues) expressed in baculovirus infected Sf9 insect cells assess...
J Med Chem 59: 8103-24 (2016)
BindingDB Entry DOI: 10.7270/Q2FF3VB3