BDBM50194980 4-(3-chloro-4-fluorophenylamino)-6-((1,4-dimethyl-1H-imidazol-5-yl)methylamino)quinoline-3-carbonitrile::CHEMBL375813
SMILES: Cc1ncn(C)c1CNc1ccc2ncc(C#N)c(Nc3ccc(F)c(Cl)c3)c2c1
InChI Key: InChIKey=XEYFSZGPBQGJNC-UHFFFAOYSA-N
Data: 1 IC50
Activity Spreadsheet -- Enzyme Inhibition Constant Data from BindingDB
Found 1 hit for monomerid = 50194980
Trg + Lig
Ki
nM
ΔG°
kcal/mole
IC50
nM
Kd
nM
EC50/IC50
nM
koff
s-1
kon
M-1s-1
pHTemp
°C
Mitogen-activated protein kinase kinase kinase 8
(Homo sapiens (Human))
BDBM50194980
(4-(3-chloro-4-fluorophenylamino)-6-((1,4-dimethyl-...)
Show SMILES Cc1ncn(C)c1CNc1ccc2ncc(C#N)c(Nc3ccc(F)c(Cl)c3)c2c1
Show InChI InChI=1S/C22H18ClFN6/c1-13-21(30(2)12-28-13)11-26-15-4-6-20-17(7-15)22(14(9-25)10-27-20)29-16-3-5-19(24)18(23)8-16/h3-8,10,12,26H,11H2,1-2H3,(H,27,29)
NCI pathway
Reactome pathway
n/an/a 200n/an/an/an/an/an/a
Wyeth Research
Curated by ChEMBL
Assay Description
Inhibition of Tpl2 kinase by ELISA
Bioorg Med Chem Lett 16: 6067-72 (2006)
Article DOI: 10.1016/j.bmcl.2006.08.102
BindingDB Entry DOI: 10.7270/Q2W958TR