BDBM50198218 5-(1-(2-(benzo[d][1,3]dioxol-5-ylmethylamino)ethyl)-1H-pyrazol-3-yl)-N-hydroxythiophene-2-carboxamide::ADS-102550::CHEMBL217716
SMILES: ONC(=O)c1ccc(s1)-c1ccn(CCNCc2ccc3OCOc3c2)n1
InChI Key: InChIKey=CCCCPSHFLXQUBH-UHFFFAOYSA-N
Data: 4 IC50
Activity Spreadsheet -- Enzyme Inhibition Constant Data from BindingDB
Found 4 hits for monomerid = 50198218
Trg + Lig
Ki
nM
ΔG°
kcal/mole
IC50
nM
Kd
nM
EC50/IC50
nM
koff
s-1
kon
M-1s-1
pHTemp
°C
Histone deacetylase 1
(Homo sapiens (Human))
BDBM50198218
(5-(1-(2-(benzo[d][1,3]dioxol-5-ylmethylamino)ethyl...)
Show SMILES ONC(=O)c1ccc(s1)-c1ccn(CCNCc2ccc3OCOc3c2)n1
Show InChI InChI=1S/C18H18N4O4S/c23-18(21-24)17-4-3-16(27-17)13-5-7-22(20-13)8-6-19-10-12-1-2-14-15(9-12)26-11-25-14/h1-5,7,9,19,24H,6,8,10-11H2,(H,21,23)
NCI pathway
Reactome pathway
n/an/a 29n/an/an/an/an/an/a
Argenta Discovery Ltd
Curated by ChEMBL
Assay Description
Inhibition of HDAC activity measured by HDAC Fluorescent Activity Assay (mean of two experiments)
Bioorg Med Chem Lett 17: 370-5 (2007)
Article DOI: 10.1016/j.bmcl.2006.10.048
BindingDB Entry DOI: 10.7270/Q21J99FD
Cytochrome P450 3A4
(Homo sapiens (Human))
BDBM50198218
(5-(1-(2-(benzo[d][1,3]dioxol-5-ylmethylamino)ethyl...)
Show SMILES ONC(=O)c1ccc(s1)-c1ccn(CCNCc2ccc3OCOc3c2)n1
Show InChI InChI=1S/C18H18N4O4S/c23-18(21-24)17-4-3-16(27-17)13-5-7-22(20-13)8-6-19-10-12-1-2-14-15(9-12)26-11-25-14/h1-5,7,9,19,24H,6,8,10-11H2,(H,21,23)
Reactome pathway
n/an/a 510n/an/an/an/an/an/a
Menarini Ricerche
Curated by ChEMBL
Assay Description
Inhibition of CYP3A4
J Med Chem 51: 1505-29 (2008)
Article DOI: 10.1021/jm7011408
BindingDB Entry DOI: 10.7270/Q2M32WMT
Histone deacetylase 1
(Homo sapiens (Human))
BDBM50198218
(5-(1-(2-(benzo[d][1,3]dioxol-5-ylmethylamino)ethyl...)
Show SMILES ONC(=O)c1ccc(s1)-c1ccn(CCNCc2ccc3OCOc3c2)n1
Show InChI InChI=1S/C18H18N4O4S/c23-18(21-24)17-4-3-16(27-17)13-5-7-22(20-13)8-6-19-10-12-1-2-14-15(9-12)26-11-25-14/h1-5,7,9,19,24H,6,8,10-11H2,(H,21,23)
NCI pathway
Reactome pathway
n/an/a 29n/an/an/an/an/an/a
Argenta Discovery Ltd
Curated by ChEMBL
Assay Description
Inhibition of HDAC activity measured by HDAC Fluorescent Activity Assay (mean of two experiments)
Bioorg Med Chem Lett 17: 363-9 (2007)
Article DOI: 10.1016/j.bmcl.2006.10.045
BindingDB Entry DOI: 10.7270/Q2VT1RR0
Cytochrome P450 3A4
(Homo sapiens (Human))
BDBM50198218
(5-(1-(2-(benzo[d][1,3]dioxol-5-ylmethylamino)ethyl...)
Show SMILES ONC(=O)c1ccc(s1)-c1ccn(CCNCc2ccc3OCOc3c2)n1
Show InChI InChI=1S/C18H18N4O4S/c23-18(21-24)17-4-3-16(27-17)13-5-7-22(20-13)8-6-19-10-12-1-2-14-15(9-12)26-11-25-14/h1-5,7,9,19,24H,6,8,10-11H2,(H,21,23)
Reactome pathway
n/an/a 5.30E+4n/an/an/an/an/an/a
Argenta Discovery Ltd
Curated by ChEMBL
Assay Description
Inhibition of CYP450 3A4
Bioorg Med Chem Lett 17: 363-9 (2007)
Article DOI: 10.1016/j.bmcl.2006.10.045
BindingDB Entry DOI: 10.7270/Q2VT1RR0