BDBM50200546 CHEMBL3939229
SMILES: COc1cccc(CN2CCN(CC2)c2cc(nc(n2)N2CCCC2)N2CCCC2)c1
InChI Key: InChIKey=ZHVMILHEPYUCKZ-UHFFFAOYSA-N
Data: 3 KI  3 IC50
Activity Spreadsheet -- Enzyme Inhibition Constant Data from BindingDB
Found 6 hits for monomerid = 50200546
Trg + Lig
Ki
nM
ΔG°
kcal/mole
IC50
nM
Kd
nM
EC50/IC50
nM
koff
s-1
kon
M-1s-1
pHTemp
°C
Caspase-1
(Homo sapiens (Human))
BDBM50200546
(CHEMBL3939229)
Show SMILES COc1cccc(CN2CCN(CC2)c2cc(nc(n2)N2CCCC2)N2CCCC2)c1
Show InChI InChI=1S/C24H34N6O/c1-31-21-8-6-7-20(17-21)19-27-13-15-29(16-14-27)23-18-22(28-9-2-3-10-28)25-24(26-23)30-11-4-5-12-30/h6-8,17-18H,2-5,9-16,19H2,1H3
NCI pathway
Reactome pathway
75n/an/an/an/an/an/an/an/a
DePaul University
Curated by ChEMBL
Assay Description
Inhibition of human recombinant N-terminal His-tagged DTT-activated caspase-1 expressed in Escherichia coli using Ac-WEHD-AMC as substrate preincubat...
Bioorg Med Chem Lett 26: 5476-5480 (2016)
Article DOI: 10.1016/j.bmcl.2016.10.025
BindingDB Entry DOI: 10.7270/Q2NZ89M0
Caspase-5
(Homo sapiens (Human))
BDBM50200546
(CHEMBL3939229)
Show SMILES COc1cccc(CN2CCN(CC2)c2cc(nc(n2)N2CCCC2)N2CCCC2)c1
Show InChI InChI=1S/C24H34N6O/c1-31-21-8-6-7-20(17-21)19-27-13-15-29(16-14-27)23-18-22(28-9-2-3-10-28)25-24(26-23)30-11-4-5-12-30/h6-8,17-18H,2-5,9-16,19H2,1H3
111n/an/an/an/an/an/an/an/a
DePaul University
Curated by ChEMBL
Assay Description
Inhibition of human recombinant DTT-activated caspase-5 expressed in Escherichia coli using Ac-WEHD-AMC as substrate preincubated for 30 mins followe...
Bioorg Med Chem Lett 26: 5476-5480 (2016)
Article DOI: 10.1016/j.bmcl.2016.10.025
BindingDB Entry DOI: 10.7270/Q2NZ89M0
Caspase-4
(Homo sapiens (Human))
BDBM50200546
(CHEMBL3939229)
Show SMILES COc1cccc(CN2CCN(CC2)c2cc(nc(n2)N2CCCC2)N2CCCC2)c1
Show InChI InChI=1S/C24H34N6O/c1-31-21-8-6-7-20(17-21)19-27-13-15-29(16-14-27)23-18-22(28-9-2-3-10-28)25-24(26-23)30-11-4-5-12-30/h6-8,17-18H,2-5,9-16,19H2,1H3
NCI pathway
Reactome pathway
276n/an/an/an/an/an/an/an/a
DePaul University
Curated by ChEMBL
Assay Description
Inhibition of human recombinant N-terminal His-tagged DTT-activated caspase-4 expressed in Escherichia coli using Ac-LEVD-AMC as substrate preincubat...
Bioorg Med Chem Lett 26: 5476-5480 (2016)
Article DOI: 10.1016/j.bmcl.2016.10.025
BindingDB Entry DOI: 10.7270/Q2NZ89M0
Caspase-1
(Homo sapiens (Human))
BDBM50200546
(CHEMBL3939229)
Show SMILES COc1cccc(CN2CCN(CC2)c2cc(nc(n2)N2CCCC2)N2CCCC2)c1
Show InChI InChI=1S/C24H34N6O/c1-31-21-8-6-7-20(17-21)19-27-13-15-29(16-14-27)23-18-22(28-9-2-3-10-28)25-24(26-23)30-11-4-5-12-30/h6-8,17-18H,2-5,9-16,19H2,1H3
NCI pathway
Reactome pathway
n/an/a 262n/an/an/an/an/an/a
DePaul University
Curated by ChEMBL
Assay Description
Inhibition of human recombinant N-terminal His-tagged DTT-activated caspase-1 expressed in Escherichia coli using Ac-WEHD-AMC as substrate preincubat...
Bioorg Med Chem Lett 26: 5476-5480 (2016)
Article DOI: 10.1016/j.bmcl.2016.10.025
BindingDB Entry DOI: 10.7270/Q2NZ89M0
Caspase-4
(Homo sapiens (Human))
BDBM50200546
(CHEMBL3939229)
Show SMILES COc1cccc(CN2CCN(CC2)c2cc(nc(n2)N2CCCC2)N2CCCC2)c1
Show InChI InChI=1S/C24H34N6O/c1-31-21-8-6-7-20(17-21)19-27-13-15-29(16-14-27)23-18-22(28-9-2-3-10-28)25-24(26-23)30-11-4-5-12-30/h6-8,17-18H,2-5,9-16,19H2,1H3
NCI pathway
Reactome pathway
n/an/a 746n/an/an/an/an/an/a
DePaul University
Curated by ChEMBL
Assay Description
Inhibition of human recombinant N-terminal His-tagged DTT-activated caspase-4 expressed in Escherichia coli using Ac-LEVD-AMC as substrate preincubat...
Bioorg Med Chem Lett 26: 5476-5480 (2016)
Article DOI: 10.1016/j.bmcl.2016.10.025
BindingDB Entry DOI: 10.7270/Q2NZ89M0
Caspase-5
(Homo sapiens (Human))
BDBM50200546
(CHEMBL3939229)
Show SMILES COc1cccc(CN2CCN(CC2)c2cc(nc(n2)N2CCCC2)N2CCCC2)c1
Show InChI InChI=1S/C24H34N6O/c1-31-21-8-6-7-20(17-21)19-27-13-15-29(16-14-27)23-18-22(28-9-2-3-10-28)25-24(26-23)30-11-4-5-12-30/h6-8,17-18H,2-5,9-16,19H2,1H3
n/an/a 482n/an/an/an/an/an/a
DePaul University
Curated by ChEMBL
Assay Description
Inhibition of human recombinant DTT-activated caspase-5 expressed in Escherichia coli using Ac-WEHD-AMC as substrate preincubated for 30 mins followe...
Bioorg Med Chem Lett 26: 5476-5480 (2016)
Article DOI: 10.1016/j.bmcl.2016.10.025
BindingDB Entry DOI: 10.7270/Q2NZ89M0