BDBM50200569 CHEMBL3946146
SMILES: C[C@H](NC(=O)CCc1nc2cccnc2n1Cc1ccc(OC(F)F)cc1)c1ccc(Cl)cc1
InChI Key: InChIKey=CSTIXCXNIUJEEA-INIZCTEOSA-N
Data: 2 IC50
Activity Spreadsheet -- Enzyme Inhibition Constant Data from BindingDB
Found 2 hits for monomerid = 50200569
Trg + Lig
Ki
nM
ΔG°
kcal/mole
IC50
nM
Kd
nM
EC50/IC50
nM
koff
s-1
kon
M-1s-1
pHTemp
°C
Ectonucleotide pyrophosphatase/phosphodiesterase family member 2
(Homo sapiens (Human))
BDBM50200569
(CHEMBL3946146)
Show SMILES C[C@H](NC(=O)CCc1nc2cccnc2n1Cc1ccc(OC(F)F)cc1)c1ccc(Cl)cc1 |r|
Show InChI InChI=1S/C25H23ClF2N4O2/c1-16(18-6-8-19(26)9-7-18)30-23(33)13-12-22-31-21-3-2-14-29-24(21)32(22)15-17-4-10-20(11-5-17)34-25(27)28/h2-11,14,16,25H,12-13,15H2,1H3,(H,30,33)/t16-/m0/s1
n/an/a 44n/an/an/an/an/an/a
Babraham Research Campus
Curated by ChEMBL
Assay Description
Inhibition of ATX in human plasma assessed as decrease in hydrolysis of lysophosphatidylcholine by measuring choline release after 24 hrs by horserad...
Bioorg Med Chem Lett 26: 5403-5410 (2016)
Article DOI: 10.1016/j.bmcl.2016.10.036
BindingDB Entry DOI: 10.7270/Q2DJ5HM1
Ectonucleotide pyrophosphatase/phosphodiesterase family member 2
(Homo sapiens (Human))
BDBM50200569
(CHEMBL3946146)
Show SMILES C[C@H](NC(=O)CCc1nc2cccnc2n1Cc1ccc(OC(F)F)cc1)c1ccc(Cl)cc1 |r|
Show InChI InChI=1S/C25H23ClF2N4O2/c1-16(18-6-8-19(26)9-7-18)30-23(33)13-12-22-31-21-3-2-14-29-24(21)32(22)15-17-4-10-20(11-5-17)34-25(27)28/h2-11,14,16,25H,12-13,15H2,1H3,(H,30,33)/t16-/m0/s1
n/an/a 2n/an/an/an/an/an/a
Babraham Research Campus
Curated by ChEMBL
Assay Description
Inhibition of human recombinant ATX using Rac-1-Palmitoyl-glycero-3-phosphocholine as substrate incubated for 2 hrs using ADHP fluorogenic peroxidase...
Bioorg Med Chem Lett 26: 5403-5410 (2016)
Article DOI: 10.1016/j.bmcl.2016.10.036
BindingDB Entry DOI: 10.7270/Q2DJ5HM1