BDBM50200636 1-(4-(4-(piperidin-1-ylmethyl)phenyl)but-3-ynyl)piperidine::4-[4-(4-Piperidin-1-ylmethyl-phenyl)-but-3-ynyl]-piperidine::CHEMBL391168
SMILES: C(CN1CCCCC1)C#Cc1ccc(CN2CCCCC2)cc1
InChI Key: InChIKey=TWJSDUFYUPMDGD-UHFFFAOYSA-N
Data: 2 KI  1 Kd
Activity Spreadsheet -- Enzyme Inhibition Constant Data from BindingDB
Found 3 hits for monomerid = 50200636
Trg + Lig
Ki
nM
ΔG°
kcal/mole
IC50
nM
Kd
nM
EC50/IC50
nM
koff
s-1
kon
M-1s-1
pHTemp
°C
Histamine H3 receptor
(Homo sapiens (Human))
BDBM50200636
(1-(4-(4-(piperidin-1-ylmethyl)phenyl)but-3-ynyl)pi...)
Show SMILES C(CN1CCCCC1)C#Cc1ccc(CN2CCCCC2)cc1
Show InChI InChI=1S/C21H30N2/c1-4-14-22(15-5-1)16-8-3-9-20-10-12-21(13-11-20)19-23-17-6-2-7-18-23/h10-13H,1-2,4-8,14-19H2
Reactome pathway
0.513n/an/an/an/an/an/an/an/a
Johnson& Johnson Pharmaceutical Research& Development
Curated by ChEMBL
Assay Description
Displacement of [3H]N-alpha-methylhistamine from human histamine H3 receptor expressed in SK-N-MC cells
Eur J Med Chem 44: 4098-106 (2009)
Article DOI: 10.1016/j.ejmech.2009.04.049
BindingDB Entry DOI: 10.7270/Q2VH5Q3G
Histamine H3 receptor
(Homo sapiens (Human))
BDBM50200636
(1-(4-(4-(piperidin-1-ylmethyl)phenyl)but-3-ynyl)pi...)
Show SMILES C(CN1CCCCC1)C#Cc1ccc(CN2CCCCC2)cc1
Show InChI InChI=1S/C21H30N2/c1-4-14-22(15-5-1)16-8-3-9-20-10-12-21(13-11-20)19-23-17-6-2-7-18-23/h10-13H,1-2,4-8,14-19H2
Reactome pathway
1.60n/an/an/an/an/an/an/an/a
Abbott Laboratories
Curated by ChEMBL
Assay Description
Displacement of [3H]-N-alpha-methylhistamine from human cloned histamine H3 receptor expressed in C6 cells
Bioorg Med Chem Lett 17: 1443-6 (2007)
Article DOI: 10.1016/j.bmcl.2006.11.073
BindingDB Entry DOI: 10.7270/Q2416WR3
Histamine H3 receptor
(Homo sapiens (Human))
BDBM50200636
(1-(4-(4-(piperidin-1-ylmethyl)phenyl)but-3-ynyl)pi...)
Show SMILES C(CN1CCCCC1)C#Cc1ccc(CN2CCCCC2)cc1
Show InChI InChI=1S/C21H30N2/c1-4-14-22(15-5-1)16-8-3-9-20-10-12-21(13-11-20)19-23-17-6-2-7-18-23/h10-13H,1-2,4-8,14-19H2
Reactome pathway
n/an/an/a 0.148n/an/an/an/an/a
Johnson& Johnson Pharmaceutical Research& Development
Curated by ChEMBL
Assay Description
Antagonist activity at human histamine H3 receptor expressed in SK-N-MC cells assessed as inhibition of forskolin-stimulated cAMP accumulation treate...
Eur J Med Chem 44: 4098-106 (2009)
Article DOI: 10.1016/j.ejmech.2009.04.049
BindingDB Entry DOI: 10.7270/Q2VH5Q3G