null
SMILES: C[C@@H]1CN(Cc2ccccc2)c2cccc(F)c2[C@H](C)N1C(=O)NC1COC1
InChI Key: InChIKey=WKNMMKHZQXULBJ-CVEARBPZSA-N
Activity Spreadsheet -- Enzyme Inhibition Constant Data from BindingDB
Found 3 hits for monomerid = 50200816
Trg + Lig
Ki
nM
ΔG°
kcal/mole
IC50
nM
Kd
nM
EC50/IC50
nM
koff
s-1
kon
M-1s-1
pHTemp
°C
Voltage-dependent T-type calcium channel subunit alpha-1H
(Homo sapiens (Human))
BDBM50200816
(CHEMBL3926201)
Show SMILES C[C@@H]1CN(Cc2ccccc2)c2cccc(F)c2[C@H](C)N1C(=O)NC1COC1 |r|
Show InChI InChI=1S/C22H26FN3O2/c1-15-11-25(12-17-7-4-3-5-8-17)20-10-6-9-19(23)21(20)16(2)26(15)22(27)24-18-13-28-14-18/h3-10,15-16,18H,11-14H2,1-2H3,(H,24,27)/t15-,16+/m1/s1
n/an/a 59n/an/an/an/an/an/a
Actelion Pharmaceuticals Ltd.
Curated by ChEMBL
Assay Description
Channel blocking activity at recombinant human CaV 3.2 channel expressed in HEK293 cells assessed as inhibition of Ca2+ flux preincubated for 3 mins ...
J Med Chem 59: 10661-10675 (2016)
Article DOI: 10.1021/acs.jmedchem.6b01356
BindingDB Entry DOI: 10.7270/Q2RV0QN8
Voltage-dependent T-type calcium channel subunit alpha-1G
(Homo sapiens (Human))
BDBM50200816
(CHEMBL3926201)
Show SMILES C[C@@H]1CN(Cc2ccccc2)c2cccc(F)c2[C@H](C)N1C(=O)NC1COC1 |r|
Show InChI InChI=1S/C22H26FN3O2/c1-15-11-25(12-17-7-4-3-5-8-17)20-10-6-9-19(23)21(20)16(2)26(15)22(27)24-18-13-28-14-18/h3-10,15-16,18H,11-14H2,1-2H3,(H,24,27)/t15-,16+/m1/s1
NCI pathway
Reactome pathway
n/an/a 40n/an/an/an/an/an/a
Actelion Pharmaceuticals Ltd.
Curated by ChEMBL
Assay Description
Channel blocking activity at recombinant human CaV 3.1 channel expressed in HEK293 cells assessed as inhibition of Ca2+ flux preincubated for 3 mins ...
J Med Chem 59: 10661-10675 (2016)
Article DOI: 10.1021/acs.jmedchem.6b01356
BindingDB Entry DOI: 10.7270/Q2RV0QN8
Voltage-dependent T-type calcium channel subunit alpha-1I
(Homo sapiens (Human))
BDBM50200816
(CHEMBL3926201)
Show SMILES C[C@@H]1CN(Cc2ccccc2)c2cccc(F)c2[C@H](C)N1C(=O)NC1COC1 |r|
Show InChI InChI=1S/C22H26FN3O2/c1-15-11-25(12-17-7-4-3-5-8-17)20-10-6-9-19(23)21(20)16(2)26(15)22(27)24-18-13-28-14-18/h3-10,15-16,18H,11-14H2,1-2H3,(H,24,27)/t15-,16+/m1/s1
Reactome pathway
n/an/a 13n/an/an/an/an/an/a
Actelion Pharmaceuticals Ltd.
Curated by ChEMBL
Assay Description
Channel blocking activity at recombinant human CaV 3.3 channel expressed in HEK293 cells assessed as inhibition of Ca2+ flux preincubated for 3 mins ...
J Med Chem 59: 10661-10675 (2016)
Article DOI: 10.1021/acs.jmedchem.6b01356
BindingDB Entry DOI: 10.7270/Q2RV0QN8