BDBM50202373 CHEMBL219075::cyclo(-D-Tyr-L-Arg-L-Arg-L-Ala-Sar-)
SMILES: [#6]-[#6@@H]-1-[#7]-[#6](=O)-[#6]-[#7](-[#6])-[#6](=O)-[#6@@H](-[#6]-c2ccc(-[#8])cc2)-[#7]-[#6](=O)-[#6@H](-[#6]-[#6]-[#6]\[#7]=[#6](\[#7])-[#7])-[#7]-[#6](=O)-[#6@H](-[#6]-[#6]-[#6]\[#7]=[#6](\[#7])-[#7])-[#7]-[#6]-1=O
InChI Key: InChIKey=DUPFTLXKUNVZDO-MVJPYGJCSA-N
Data: 1 IC50
Activity Spreadsheet -- Enzyme Inhibition Constant Data from BindingDB
Found 1 hit for monomerid = 50202373
Trg + Lig
Ki
nM
ΔG°
kcal/mole
IC50
nM
Kd
nM
EC50/IC50
nM
koff
s-1
kon
M-1s-1
pHTemp
°C
C-X-C chemokine receptor type 4 (CXCR4)
(Homo sapiens (Human))
BDBM50202373
(CHEMBL219075 | cyclo(-D-Tyr-L-Arg-L-Arg-L-Ala-Sar-...)
Show SMILES [#6]-[#6@@H]-1-[#7]-[#6](=O)-[#6]-[#7](-[#6])-[#6](=O)-[#6@@H](-[#6]-c2ccc(-[#8])cc2)-[#7]-[#6](=O)-[#6@H](-[#6]-[#6]-[#6]\[#7]=[#6](\[#7])-[#7])-[#7]-[#6](=O)-[#6@H](-[#6]-[#6]-[#6]\[#7]=[#6](\[#7])-[#7])-[#7]-[#6]-1=O |r|
Show InChI InChI=1S/C27H43N11O6/c1-15-22(41)35-18(5-3-11-32-26(28)29)23(42)36-19(6-4-12-33-27(30)31)24(43)37-20(13-16-7-9-17(39)10-8-16)25(44)38(2)14-21(40)34-15/h7-10,15,18-20,39H,3-6,11-14H2,1-2H3,(H,34,40)(H,35,41)(H,36,42)(H,37,43)(H4,28,29,32)(H4,30,31,33)/t15-,18-,19-,20+/m0/s1
n/an/a 167n/an/an/an/an/an/a
Kyoto University
Curated by ChEMBL
Assay Description
Inhibition of [125I]SDF1 binding to CXCR4 transfected in CHO cells
J Med Chem 50: 192-8 (2007)
Article DOI: 10.1021/jm0607350
BindingDB Entry DOI: 10.7270/Q25M65D3