BDBM50202442 CHEMBL3263916
SMILES: CCCCn1cc(\C=C2/Oc3cc(O)cc(O)c3C2=O)c2cc(C)ccc12
InChI Key: InChIKey=RVTBQLHGUHRZHN-UKWGHVSLSA-N
Data: 1 IC50
Activity Spreadsheet -- Enzyme Inhibition Constant Data from BindingDB
Found 1 hit for monomerid = 50202442
Trg + Lig
Ki
nM
ΔG°
kcal/mole
IC50
nM
Kd
nM
EC50/IC50
nM
koff
s-1
kon
M-1s-1
pHTemp
°C
Multidrug resistance-associated protein 2 (MRP2)
(Homo sapiens (Human))
BDBM50202442
(CHEMBL3263916)
Show SMILES CCCCn1cc(\C=C2/Oc3cc(O)cc(O)c3C2=O)c2cc(C)ccc12
Show InChI InChI=1S/C22H21NO4/c1-3-4-7-23-12-14(16-8-13(2)5-6-17(16)23)9-20-22(26)21-18(25)10-15(24)11-19(21)27-20/h5-6,8-12,24-25H,3-4,7H2,1-2H3/b20-9-
n/an/a 4.80E+3n/an/an/an/an/an/a
BMSSI UMR 5086 CNRS/Universit£ Lyon 1
Curated by ChEMBL
Assay Description
Inhibition of ABCC2 (unknown origin) expressed in MDCK2 cells assessed as inhibition of calcein-AM efflux measured after 30 mins in presence of ABCB1...
Eur J Med Chem 122: 408-418 (2016)
Article DOI: 10.1016/j.ejmech.2016.06.039
BindingDB Entry DOI: 10.7270/Q2RN39TM