BDBM50203678 CHEMBL3905342
SMILES: CCC(=O)N1CC[C@@H](C1)Oc1ccnc2ccc(cc12)-c1ccc(OC)nc1
InChI Key: InChIKey=GKVUBNGBTYQPGF-KRWDZBQOSA-N
Data: 8 IC50
Activity Spreadsheet -- Enzyme Inhibition Constant Data from BindingDB
Found 8 hits for monomerid = 50203678
Trg + Lig
Ki
nM
ΔG°
kcal/mole
IC50
nM
Kd
nM
EC50/IC50
nM
koff
s-1
kon
M-1s-1
pHTemp
°C
Phosphatidylinositol 4,5-bisphosphate 3-kinase catalytic subunit beta isoform
(Homo sapiens (Human))
BDBM50203678
(CHEMBL3905342)
Show SMILES CCC(=O)N1CC[C@@H](C1)Oc1ccnc2ccc(cc12)-c1ccc(OC)nc1 |r|
Show InChI InChI=1S/C22H23N3O3/c1-3-22(26)25-11-9-17(14-25)28-20-8-10-23-19-6-4-15(12-18(19)20)16-5-7-21(27-2)24-13-16/h4-8,10,12-13,17H,3,9,11,14H2,1-2H3/t17-/m0/s1
NCI pathway
Reactome pathway
n/an/a 655n/an/an/an/an/an/a
Novartis Institutes for BioMedical Research
Curated by ChEMBL
Assay Description
Inhibition of PI3K-beta (unknown origin) by KinaseGlo assay
Bioorg Med Chem Lett 26: 5657-5662 (2016)
Article DOI: 10.1016/j.bmcl.2016.10.069
BindingDB Entry DOI: 10.7270/Q20Z7574
Phosphatidylinositol 4,5-bisphosphate 3-kinase catalytic subunit delta isoform
(Mus musculus (Mouse))
BDBM50203678
(CHEMBL3905342)
Show SMILES CCC(=O)N1CC[C@@H](C1)Oc1ccnc2ccc(cc12)-c1ccc(OC)nc1 |r|
Show InChI InChI=1S/C22H23N3O3/c1-3-22(26)25-11-9-17(14-25)28-20-8-10-23-19-6-4-15(12-18(19)20)16-5-7-21(27-2)24-13-16/h4-8,10,12-13,17H,3,9,11,14H2,1-2H3/t17-/m0/s1
n/an/a 155n/an/an/an/an/an/a
Novartis Institutes for BioMedical Research
Curated by ChEMBL
Assay Description
Inhibition of PI3K-delta in mouse splenocytes assessed as inhibition anti-IgM induced CD86 expression
Bioorg Med Chem Lett 26: 5657-5662 (2016)
Article DOI: 10.1016/j.bmcl.2016.10.069
BindingDB Entry DOI: 10.7270/Q20Z7574
Phosphatidylinositol 4,5-bisphosphate 3-kinase catalytic subunit delta isoform
(Homo sapiens (Human))
BDBM50203678
(CHEMBL3905342)
Show SMILES CCC(=O)N1CC[C@@H](C1)Oc1ccnc2ccc(cc12)-c1ccc(OC)nc1 |r|
Show InChI InChI=1S/C22H23N3O3/c1-3-22(26)25-11-9-17(14-25)28-20-8-10-23-19-6-4-15(12-18(19)20)16-5-7-21(27-2)24-13-16/h4-8,10,12-13,17H,3,9,11,14H2,1-2H3/t17-/m0/s1
NCI pathway
Reactome pathway
n/an/a 162n/an/an/an/an/an/a
Novartis Institutes for BioMedical Research
Curated by ChEMBL
Assay Description
Inhibition of myristoylated PI3K-delta (unknown origin) overexpressed in Rat1 cells assessed as inhibition of Akt phosphorylation
Bioorg Med Chem Lett 26: 5657-5662 (2016)
Article DOI: 10.1016/j.bmcl.2016.10.069
BindingDB Entry DOI: 10.7270/Q20Z7574
Phosphatidylinositol 4,5-bisphosphate 3-kinase catalytic subunit alpha isoform
(Homo sapiens (Human))
BDBM50203678
(CHEMBL3905342)
Show SMILES CCC(=O)N1CC[C@@H](C1)Oc1ccnc2ccc(cc12)-c1ccc(OC)nc1 |r|
Show InChI InChI=1S/C22H23N3O3/c1-3-22(26)25-11-9-17(14-25)28-20-8-10-23-19-6-4-15(12-18(19)20)16-5-7-21(27-2)24-13-16/h4-8,10,12-13,17H,3,9,11,14H2,1-2H3/t17-/m0/s1
NCI pathway
Reactome pathway
n/an/a 606n/an/an/an/an/an/a
Novartis Institutes for BioMedical Research
Curated by ChEMBL
Assay Description
Inhibition of myristoylated PI3K-alpha (unknown origin) overexpressed in Rat1 cells assessed as inhibition of Akt phosphorylation
Bioorg Med Chem Lett 26: 5657-5662 (2016)
Article DOI: 10.1016/j.bmcl.2016.10.069
BindingDB Entry DOI: 10.7270/Q20Z7574
Phosphatidylinositol 4,5-bisphosphate 3-kinase catalytic subunit gamma isoform
(Homo sapiens (Human))
BDBM50203678
(CHEMBL3905342)
Show SMILES CCC(=O)N1CC[C@@H](C1)Oc1ccnc2ccc(cc12)-c1ccc(OC)nc1 |r|
Show InChI InChI=1S/C22H23N3O3/c1-3-22(26)25-11-9-17(14-25)28-20-8-10-23-19-6-4-15(12-18(19)20)16-5-7-21(27-2)24-13-16/h4-8,10,12-13,17H,3,9,11,14H2,1-2H3/t17-/m0/s1
NCI pathway
Reactome pathway
n/an/a 828n/an/an/an/an/an/a
Novartis Institutes for BioMedical Research
Curated by ChEMBL
Assay Description
Inhibition of PI3K-gamma (unknown origin) by KinaseGlo assay
Bioorg Med Chem Lett 26: 5657-5662 (2016)
Article DOI: 10.1016/j.bmcl.2016.10.069
BindingDB Entry DOI: 10.7270/Q20Z7574
Phosphatidylinositol 4,5-bisphosphate 3-kinase catalytic subunit beta isoform
(Homo sapiens (Human))
BDBM50203678
(CHEMBL3905342)
Show SMILES CCC(=O)N1CC[C@@H](C1)Oc1ccnc2ccc(cc12)-c1ccc(OC)nc1 |r|
Show InChI InChI=1S/C22H23N3O3/c1-3-22(26)25-11-9-17(14-25)28-20-8-10-23-19-6-4-15(12-18(19)20)16-5-7-21(27-2)24-13-16/h4-8,10,12-13,17H,3,9,11,14H2,1-2H3/t17-/m0/s1
NCI pathway
Reactome pathway
n/an/a 877n/an/an/an/an/an/a
Novartis Institutes for BioMedical Research
Curated by ChEMBL
Assay Description
Inhibition of myristoylated PI3K-beta (unknown origin) overexpressed in Rat1 cells assessed as inhibition of Akt phosphorylation
Bioorg Med Chem Lett 26: 5657-5662 (2016)
Article DOI: 10.1016/j.bmcl.2016.10.069
BindingDB Entry DOI: 10.7270/Q20Z7574
Phosphatidylinositol 4,5-bisphosphate 3-kinase catalytic subunit alpha isoform
(Homo sapiens (Human))
BDBM50203678
(CHEMBL3905342)
Show SMILES CCC(=O)N1CC[C@@H](C1)Oc1ccnc2ccc(cc12)-c1ccc(OC)nc1 |r|
Show InChI InChI=1S/C22H23N3O3/c1-3-22(26)25-11-9-17(14-25)28-20-8-10-23-19-6-4-15(12-18(19)20)16-5-7-21(27-2)24-13-16/h4-8,10,12-13,17H,3,9,11,14H2,1-2H3/t17-/m0/s1
NCI pathway
Reactome pathway
n/an/a 220n/an/an/an/an/an/a
Novartis Institutes for BioMedical Research
Curated by ChEMBL
Assay Description
Inhibition of PI3K-alpha (unknown origin) by KinaseGlo assay
Bioorg Med Chem Lett 26: 5657-5662 (2016)
Article DOI: 10.1016/j.bmcl.2016.10.069
BindingDB Entry DOI: 10.7270/Q20Z7574
Phosphatidylinositol 4,5-bisphosphate 3-kinase catalytic subunit delta isoform
(Homo sapiens (Human))
BDBM50203678
(CHEMBL3905342)
Show SMILES CCC(=O)N1CC[C@@H](C1)Oc1ccnc2ccc(cc12)-c1ccc(OC)nc1 |r|
Show InChI InChI=1S/C22H23N3O3/c1-3-22(26)25-11-9-17(14-25)28-20-8-10-23-19-6-4-15(12-18(19)20)16-5-7-21(27-2)24-13-16/h4-8,10,12-13,17H,3,9,11,14H2,1-2H3/t17-/m0/s1
NCI pathway
Reactome pathway
n/an/a 11n/an/an/an/an/an/a
Novartis Institutes for BioMedical Research
Curated by ChEMBL
Assay Description
Inhibition of PI3K-delta (unknown origin) by KinaseGlo assay
Bioorg Med Chem Lett 26: 5657-5662 (2016)
Article DOI: 10.1016/j.bmcl.2016.10.069
BindingDB Entry DOI: 10.7270/Q20Z7574