BDBM50207515 CHEMBL3966208
SMILES: CC(C)S(=O)(=O)c1ccc(CNC(=O)c2sc3nnc(C)c(C)c3c2N)cc1
InChI Key: InChIKey=DBEVLLPZKAMJGN-UHFFFAOYSA-N
Data: 2 EC50
Activity Spreadsheet -- Enzyme Inhibition Constant Data from BindingDB
Found 2 hits for monomerid = 50207515
Trg + Lig
Ki
nM
ΔG°
kcal/mole
IC50
nM
Kd
nM
EC50/IC50
nM
koff
s-1
kon
M-1s-1
pHTemp
°C
Muscarinic acetylcholine receptor M4
(RAT)
BDBM50207515
(CHEMBL3966208)
Show SMILES CC(C)S(=O)(=O)c1ccc(CNC(=O)c2sc3nnc(C)c(C)c3c2N)cc1
Show InChI InChI=1S/C19H22N4O3S2/c1-10(2)28(25,26)14-7-5-13(6-8-14)9-21-18(24)17-16(20)15-11(3)12(4)22-23-19(15)27-17/h5-8,10H,9,20H2,1-4H3,(H,21,24)
n/an/an/an/a 48n/an/an/an/a
Vanderbilt University Medical Center
Curated by ChEMBL
Assay Description
Positive allosteric modulation of rat M4 receptor expressed in CHO cells co-expressing Gqui5 by calcium mobilization assay
Bioorg Med Chem Lett 27: 171-175 (2017)
Article DOI: 10.1016/j.bmcl.2016.11.086
BindingDB Entry DOI: 10.7270/Q2WM1GC0
Muscarinic acetylcholine receptor M4
(RAT)
BDBM50207515
(CHEMBL3966208)
Show SMILES CC(C)S(=O)(=O)c1ccc(CNC(=O)c2sc3nnc(C)c(C)c3c2N)cc1
Show InChI InChI=1S/C19H22N4O3S2/c1-10(2)28(25,26)14-7-5-13(6-8-14)9-21-18(24)17-16(20)15-11(3)12(4)22-23-19(15)27-17/h5-8,10H,9,20H2,1-4H3,(H,21,24)
n/an/an/an/a 48n/an/an/an/a
Vanderbilt University Medical Center
Curated by ChEMBL
Assay Description
Positive allosteric modulation of rat M4 receptor expressed in CHO cells co-expressing Gqui5 by calcium mobilization assay
Bioorg Med Chem Lett 27: 171-175 (2017)
Article DOI: 10.1016/j.bmcl.2016.11.086
BindingDB Entry DOI: 10.7270/Q2WM1GC0