BDBM50210709 CHEMBL396765::N1-((2S,3R)-4-(3-methoxybenzylamino)-1-(3,5-difluorophenyl)-3-hydroxybutan-2-yl)-N3,N3-dipropylbenzene-1,3,5-tricarboxamide::N~3~-{(1S,2R)-1-(3,5-DIFLUOROBENZYL)-2-HYDROXY-3-[(3-METHOXYBENZYL)AMINO]PROPYL}-N~1~,N~1~-DIPROPYLBENZENE-1,3,5-TRICARBOXAMIDE
SMILES: CCCN(CCC)C(=O)c1cc(cc(c1)C(=O)N[C@@H](Cc1cc(F)cc(F)c1)[C@H](O)CNCc1cccc(OC)c1)C(N)=O
InChI Key: InChIKey=XIQAKRFMIYGAIR-XZWHSSHBSA-N
Data: 2 IC50
PDB links: 1 PDB ID matches this monomer.
Activity Spreadsheet -- Enzyme Inhibition Constant Data from BindingDB
Found 2 hits for monomerid = 50210709
Trg + Lig
Ki
nM
ΔG°
kcal/mole
IC50
nM
Kd
nM
EC50/IC50
nM
koff
s-1
kon
M-1s-1
pHTemp
°C
Cathepsin D
(Homo sapiens (Human))
BDBM50210709
(CHEMBL396765 | N1-((2S,3R)-4-(3-methoxybenzylamino...)
Show SMILES CCCN(CCC)C(=O)c1cc(cc(c1)C(=O)N[C@@H](Cc1cc(F)cc(F)c1)[C@H](O)CNCc1cccc(OC)c1)C(N)=O
Show InChI InChI=1S/C33H40F2N4O5/c1-4-9-39(10-5-2)33(43)25-16-23(31(36)41)15-24(17-25)32(42)38-29(14-22-11-26(34)18-27(35)12-22)30(40)20-37-19-21-7-6-8-28(13-21)44-3/h6-8,11-13,15-18,29-30,37,40H,4-5,9-10,14,19-20H2,1-3H3,(H2,36,41)(H,38,42)/t29-,30+/m0/s1
NCI pathway
Reactome pathway
n/an/a 2.40E+3n/an/an/an/an/an/a
Pfizer Global Research and Development
Curated by ChEMBL
Assay Description
Inhibition of cathepsin D
Bioorg Med Chem Lett 17: 3378-83 (2007)
Article DOI: 10.1016/j.bmcl.2007.03.096
BindingDB Entry DOI: 10.7270/Q2RB748S
Beta-secretase 1
(Homo sapiens (Human))
BDBM50210709
(CHEMBL396765 | N1-((2S,3R)-4-(3-methoxybenzylamino...)
Show SMILES CCCN(CCC)C(=O)c1cc(cc(c1)C(=O)N[C@@H](Cc1cc(F)cc(F)c1)[C@H](O)CNCc1cccc(OC)c1)C(N)=O
Show InChI InChI=1S/C33H40F2N4O5/c1-4-9-39(10-5-2)33(43)25-16-23(31(36)41)15-24(17-25)32(42)38-29(14-22-11-26(34)18-27(35)12-22)30(40)20-37-19-21-7-6-8-28(13-21)44-3/h6-8,11-13,15-18,29-30,37,40H,4-5,9-10,14,19-20H2,1-3H3,(H2,36,41)(H,38,42)/t29-,30+/m0/s1
n/an/a 11n/an/an/an/an/an/a
Pfizer Global Research and Development
Curated by ChEMBL
Assay Description
Inhibition of BACE1
Bioorg Med Chem Lett 17: 3378-83 (2007)
Article DOI: 10.1016/j.bmcl.2007.03.096
BindingDB Entry DOI: 10.7270/Q2RB748S
3D
3D Structure (crystal)