BDBM50211137 (R)-N-(1-(3-(4-nitrophenyl)-4-oxo-3,4-dihydroquinazolin-2-yl)ethyl)-N-(pyridin-3-ylmethyl)-2-(4-(trifluoromethyl)phenyl)acetamide::CHEMBL395746
SMILES: C[C@@H](N(Cc1cccnc1)C(=O)Cc1ccc(cc1)C(F)(F)F)c1nc2ccccc2c(=O)n1-c1ccc(cc1)[N+]([O-])=O
InChI Key: InChIKey=IEURZEWGBXTYSK-HXUWFJFHSA-N
Data: 1 IC50
Activity Spreadsheet -- Enzyme Inhibition Constant Data from BindingDB
Found 1 hit for monomerid = 50211137
Trg + Lig
Ki
nM
ΔG°
kcal/mole
IC50
nM
Kd
nM
EC50/IC50
nM
koff
s-1
kon
M-1s-1
pHTemp
°C
chemokine (C-X-C motif) receptor 3
(Homo sapiens (Human))
BDBM50211137
((R)-N-(1-(3-(4-nitrophenyl)-4-oxo-3,4-dihydroquina...)
Show SMILES C[C@@H](N(Cc1cccnc1)C(=O)Cc1ccc(cc1)C(F)(F)F)c1nc2ccccc2c(=O)n1-c1ccc(cc1)[N+]([O-])=O
Show InChI InChI=1S/C31H24F3N5O4/c1-20(29-36-27-7-3-2-6-26(27)30(41)38(29)24-12-14-25(15-13-24)39(42)43)37(19-22-5-4-16-35-18-22)28(40)17-21-8-10-23(11-9-21)31(32,33)34/h2-16,18,20H,17,19H2,1H3/t20-/m1/s1
n/an/a 7n/an/an/an/an/an/a
Amgen Inc.
Curated by ChEMBL
Assay Description
Displacement of [125I ]IP10 from CXCR3 receptor expressed in PBMC
Bioorg Med Chem Lett 17: 3339-43 (2007)
Article DOI: 10.1016/j.bmcl.2007.03.106
BindingDB Entry DOI: 10.7270/Q2VT1SXN