BDBM50213753 7-chloro-3-(2-fluoro-phenylamino)-1,1-dioxo-1,4-dihydro-1lambda6-benzo[1,2,4]thiadiazin-5-ol::CHEMBL393046
SMILES: Oc1cc(Cl)cc2c1N=C(Nc1ccccc1F)NS2(=O)=O
InChI Key: InChIKey=HSEBBCWAZOTVEK-UHFFFAOYSA-N
Data: 1 IC50
Activity Spreadsheet -- Enzyme Inhibition Constant Data from BindingDB
Found 1 hit for monomerid = 50213753
Trg + Lig
Ki
nM
ΔG°
kcal/mole
IC50
nM
Kd
nM
EC50/IC50
nM
koff
s-1
kon
M-1s-1
pHTemp
°C
C-X-C chemokine receptor type 2
(Homo sapiens (Human))
BDBM50213753
(7-chloro-3-(2-fluoro-phenylamino)-1,1-dioxo-1,4-di...)
Show SMILES Oc1cc(Cl)cc2c1N=C(Nc1ccccc1F)NS2(=O)=O |t:9|
Show InChI InChI=1S/C13H9ClFN3O3S/c14-7-5-10(19)12-11(6-7)22(20,21)18-13(17-12)16-9-4-2-1-3-8(9)15/h1-6,19H,(H2,16,17,18)
Reactome pathway
n/an/a 740n/an/an/an/an/an/a
GlaxoSmithKline
Curated by ChEMBL
Assay Description
Antagonist activity at CXCR2 receptor expressed in CHOK1 cells assessed as human IL8-induced calcium mobilization by FLIPR
Bioorg Med Chem Lett 17: 3864-7 (2007)
Article DOI: 10.1016/j.bmcl.2007.05.011
BindingDB Entry DOI: 10.7270/Q21C1WKG