BDBM50215714 2-chloro-4-((3aR,4R)-4-hydroxy-1,1-dioxo-tetrahydro-1lambda6-thia-2,6a-diaza-pentalen-2-yl)-3-methyl-benzonitrile::CHEMBL234185
SMILES: Cc1c(Cl)c(ccc1N1C[C@@H]2[C@H](O)CCN2S1(=O)=O)C#N
InChI Key: InChIKey=XFADBKORAWPWJX-VXGBXAGGSA-N
Data: 1 KI  1 EC50
Activity Spreadsheet -- Enzyme Inhibition Constant Data from BindingDB
Found 2 hits for monomerid = 50215714
Trg + Lig
Ki
nM
ΔG°
kcal/mole
IC50
nM
Kd
nM
EC50/IC50
nM
koff
s-1
kon
M-1s-1
pHTemp
°C
Androgen Receptor
(Homo sapiens (Human))
BDBM50215714
(2-chloro-4-((3aR,4R)-4-hydroxy-1,1-dioxo-tetrahydr...)
Show SMILES Cc1c(Cl)c(ccc1N1C[C@@H]2[C@H](O)CCN2S1(=O)=O)C#N
Show InChI InChI=1S/C13H14ClN3O3S/c1-8-10(3-2-9(6-15)13(8)14)17-7-11-12(18)4-5-16(11)21(17,19)20/h2-3,11-12,18H,4-5,7H2,1H3/t11-,12-/m1/s1
NCI pathway
Reactome pathway
14n/an/an/an/an/an/an/an/a
Bristol-Myers Squibb Research and Development
Curated by ChEMBL
Assay Description
Displacement of [3H]DHT from human androgen receptor in MDA453 cells
Bioorg Med Chem Lett 17: 4487-90 (2007)
Article DOI: 10.1016/j.bmcl.2007.06.007
BindingDB Entry DOI: 10.7270/Q2NV9HZ9
Androgen Receptor
(Mus musculus)
BDBM50215714
(2-chloro-4-((3aR,4R)-4-hydroxy-1,1-dioxo-tetrahydr...)
Show SMILES Cc1c(Cl)c(ccc1N1C[C@@H]2[C@H](O)CCN2S1(=O)=O)C#N
Show InChI InChI=1S/C13H14ClN3O3S/c1-8-10(3-2-9(6-15)13(8)14)17-7-11-12(18)4-5-16(11)21(17,19)20/h2-3,11-12,18H,4-5,7H2,1H3/t11-,12-/m1/s1
Reactome pathway
n/an/an/an/a 7.73E+3n/an/an/an/a
Bristol-Myers Squibb Research and Development
Curated by ChEMBL
Assay Description
Agonist activity at androgen receptor in mouse C2C12 cells by receptor transactivation assay
Bioorg Med Chem Lett 17: 4487-90 (2007)
Article DOI: 10.1016/j.bmcl.2007.06.007
BindingDB Entry DOI: 10.7270/Q2NV9HZ9