BDBM50217569 4-(3-(4-(piperidin-1-yl)but-1-ynyl)benzyl)morpholine::4-[3-(4-Piperidin-1-yl-but-1-ynyl)-benzyl]-morpholine::CHEMBL237087
SMILES: C(CN1CCCCC1)C#Cc1cccc(CN2CCOCC2)c1
InChI Key: InChIKey=HDRIBIYPLKZUDQ-UHFFFAOYSA-N
Data: 7 KI  2 Kd
Activity Spreadsheet -- Enzyme Inhibition Constant Data from BindingDB
Found 9 hits for monomerid = 50217569
Trg + Lig
Ki
nM
ΔG°
kcal/mole
IC50
nM
Kd
nM
EC50/IC50
nM
koff
s-1
kon
M-1s-1
pHTemp
°C
Histamine H3 receptor
(Homo sapiens (Human))
BDBM50217569
(4-(3-(4-(piperidin-1-yl)but-1-ynyl)benzyl)morpholi...)
Show SMILES C(CN1CCCCC1)C#Cc1cccc(CN2CCOCC2)c1
Show InChI InChI=1S/C20H28N2O/c1-3-10-21(11-4-1)12-5-2-7-19-8-6-9-20(17-19)18-22-13-15-23-16-14-22/h6,8-9,17H,1,3-5,10-16,18H2
Reactome pathway
0.800n/an/an/an/an/an/an/an/a
Johnson& Johnson Pharmaceutical Research& Development
Curated by ChEMBL
Assay Description
Displacement of [125I]iodoproxyfan from human recombinant histamine H3 receptor expressed in human SK-N-MC cells after 1 hr by fluid scintillation co...
Bioorg Med Chem Lett 20: 6226-30 (2010)
Article DOI: 10.1016/j.bmcl.2010.08.103
BindingDB Entry DOI: 10.7270/Q2CF9QB3
Histamine H3 receptor
(Homo sapiens (Human))
BDBM50217569
(4-(3-(4-(piperidin-1-yl)but-1-ynyl)benzyl)morpholi...)
Show SMILES C(CN1CCCCC1)C#Cc1cccc(CN2CCOCC2)c1
Show InChI InChI=1S/C20H28N2O/c1-3-10-21(11-4-1)12-5-2-7-19-8-6-9-20(17-19)18-22-13-15-23-16-14-22/h6,8-9,17H,1,3-5,10-16,18H2
Reactome pathway
1n/an/an/an/an/an/an/an/a
Johnson& Johnson Pharmaceutical Research and Development
Curated by ChEMBL
Assay Description
Displacement of [3H]N-alpha-methylhistamine from human histamine H3 receptor expressed in SK-N-MC cells
Eur J Med Chem 44: 4413-25 (2009)
Article DOI: 10.1016/j.ejmech.2009.06.007
BindingDB Entry DOI: 10.7270/Q28S4Q7C
Histamine H3 receptor
(Homo sapiens (Human))
BDBM50217569
(4-(3-(4-(piperidin-1-yl)but-1-ynyl)benzyl)morpholi...)
Show SMILES C(CN1CCCCC1)C#Cc1cccc(CN2CCOCC2)c1
Show InChI InChI=1S/C20H28N2O/c1-3-10-21(11-4-1)12-5-2-7-19-8-6-9-20(17-19)18-22-13-15-23-16-14-22/h6,8-9,17H,1,3-5,10-16,18H2
Reactome pathway
1.17n/an/an/an/an/an/an/an/a
Johnson& Johnson Pharmaceutical Research& Development
Curated by ChEMBL
Assay Description
Displacement of [3H]N-alpha-methylhistamine from human histamine H3 receptor expressed in SK-N-MC cells
Eur J Med Chem 44: 4098-106 (2009)
Article DOI: 10.1016/j.ejmech.2009.04.049
BindingDB Entry DOI: 10.7270/Q2VH5Q3G
Histamine H3 receptor
(Homo sapiens (Human))
BDBM50217569
(4-(3-(4-(piperidin-1-yl)but-1-ynyl)benzyl)morpholi...)
Show SMILES C(CN1CCCCC1)C#Cc1cccc(CN2CCOCC2)c1
Show InChI InChI=1S/C20H28N2O/c1-3-10-21(11-4-1)12-5-2-7-19-8-6-9-20(17-19)18-22-13-15-23-16-14-22/h6,8-9,17H,1,3-5,10-16,18H2
Reactome pathway
1.30n/an/an/an/an/an/an/an/a
Johnson & Johnson Pharmaceutical Research & Development LLC
Curated by ChEMBL
Assay Description
Binding affinity to human histamine H3 receptor
Bioorg Med Chem Lett 17: 4799-803 (2007)
Article DOI: 10.1016/j.bmcl.2007.06.061
BindingDB Entry DOI: 10.7270/Q2F18ZFF
Histamine H3 receptor
(Rattus norvegicus (rat))
BDBM50217569
(4-(3-(4-(piperidin-1-yl)but-1-ynyl)benzyl)morpholi...)
Show SMILES C(CN1CCCCC1)C#Cc1cccc(CN2CCOCC2)c1
Show InChI InChI=1S/C20H28N2O/c1-3-10-21(11-4-1)12-5-2-7-19-8-6-9-20(17-19)18-22-13-15-23-16-14-22/h6,8-9,17H,1,3-5,10-16,18H2
Reactome pathway
7.08n/an/an/an/an/an/an/an/a
Johnson& Johnson Pharmaceutical Research& Development
Curated by ChEMBL
Assay Description
Displacement of [3H]N-alpha-methylhistamine from rat histamine H3 receptor expressed in SK-N-MC cells
Eur J Med Chem 44: 4098-106 (2009)
Article DOI: 10.1016/j.ejmech.2009.04.049
BindingDB Entry DOI: 10.7270/Q2VH5Q3G
Histamine H1 receptor
(Homo sapiens (Human))
BDBM50217569
(4-(3-(4-(piperidin-1-yl)but-1-ynyl)benzyl)morpholi...)
Show SMILES C(CN1CCCCC1)C#Cc1cccc(CN2CCOCC2)c1
Show InChI InChI=1S/C20H28N2O/c1-3-10-21(11-4-1)12-5-2-7-19-8-6-9-20(17-19)18-22-13-15-23-16-14-22/h6,8-9,17H,1,3-5,10-16,18H2
Reactome pathway
>1.00E+4n/an/an/an/an/an/an/an/a
Johnson& Johnson Pharmaceutical Research& Development
Curated by ChEMBL
Assay Description
Displacement of [3H]N-alpha-methylhistamine from histamine H1 receptor expressed in SK-N-MC cells
Eur J Med Chem 44: 4098-106 (2009)
Article DOI: 10.1016/j.ejmech.2009.04.049
BindingDB Entry DOI: 10.7270/Q2VH5Q3G
Histamine H4 receptor
(Homo sapiens (Human))
BDBM50217569
(4-(3-(4-(piperidin-1-yl)but-1-ynyl)benzyl)morpholi...)
Show SMILES C(CN1CCCCC1)C#Cc1cccc(CN2CCOCC2)c1
Show InChI InChI=1S/C20H28N2O/c1-3-10-21(11-4-1)12-5-2-7-19-8-6-9-20(17-19)18-22-13-15-23-16-14-22/h6,8-9,17H,1,3-5,10-16,18H2
Reactome pathway
>1.00E+4n/an/an/an/an/an/an/an/a
Johnson& Johnson Pharmaceutical Research& Development
Curated by ChEMBL
Assay Description
Displacement of [3H]N-alpha-methylhistamine from histamine H4 receptor expressed in SK-N-MC cells
Eur J Med Chem 44: 4098-106 (2009)
Article DOI: 10.1016/j.ejmech.2009.04.049
BindingDB Entry DOI: 10.7270/Q2VH5Q3G
Histamine H3 receptor
(Rattus norvegicus (rat))
BDBM50217569
(4-(3-(4-(piperidin-1-yl)but-1-ynyl)benzyl)morpholi...)
Show SMILES C(CN1CCCCC1)C#Cc1cccc(CN2CCOCC2)c1
Show InChI InChI=1S/C20H28N2O/c1-3-10-21(11-4-1)12-5-2-7-19-8-6-9-20(17-19)18-22-13-15-23-16-14-22/h6,8-9,17H,1,3-5,10-16,18H2
Reactome pathway
n/an/an/a 4.68n/an/an/an/an/a
Johnson& Johnson Pharmaceutical Research& Development
Curated by ChEMBL
Assay Description
Antagonist activity at rat H3 receptor expressed in SK-N-MC cells assessed as inhibition of forskolin-stimulated cAMP accumulation treated 10 min bef...
Eur J Med Chem 44: 4098-106 (2009)
Article DOI: 10.1016/j.ejmech.2009.04.049
BindingDB Entry DOI: 10.7270/Q2VH5Q3G
Histamine H3 receptor
(Homo sapiens (Human))
BDBM50217569
(4-(3-(4-(piperidin-1-yl)but-1-ynyl)benzyl)morpholi...)
Show SMILES C(CN1CCCCC1)C#Cc1cccc(CN2CCOCC2)c1
Show InChI InChI=1S/C20H28N2O/c1-3-10-21(11-4-1)12-5-2-7-19-8-6-9-20(17-19)18-22-13-15-23-16-14-22/h6,8-9,17H,1,3-5,10-16,18H2
Reactome pathway
n/an/an/a 0.490n/an/an/an/an/a
Johnson& Johnson Pharmaceutical Research& Development
Curated by ChEMBL
Assay Description
Antagonist activity at human histamine H3 receptor expressed in SK-N-MC cells assessed as inhibition of forskolin-stimulated cAMP accumulation treate...
Eur J Med Chem 44: 4098-106 (2009)
Article DOI: 10.1016/j.ejmech.2009.04.049
BindingDB Entry DOI: 10.7270/Q2VH5Q3G