BDBM50218478 4-{2-[2-(4-fluoro-phenyl)-acetylamino]-7,7,10,10-tetramethyl-5-propyl-7,8,9,10-tetrahydro-5H-5,13-diaza-benzo[4,5]cyclohepta[1,2-b]naphthalen-12-yl}-benzoic acid::CHEMBL237770
SMILES: CCCN1c2ccc(NC(=O)Cc3ccc(F)cc3)cc2N=C(c2ccc(cc2)C(O)=O)c2cc3c(cc12)C(C)(C)CCC3(C)C
InChI Key: InChIKey=MXDUECRJFKOPDQ-UHFFFAOYSA-N
Data: 2 IC50
Activity Spreadsheet -- Enzyme Inhibition Constant Data from BindingDB
Found 2 hits for monomerid = 50218478
Trg + Lig
Ki
nM
ΔG°
kcal/mole
IC50
nM
Kd
nM
EC50/IC50
nM
koff
s-1
kon
M-1s-1
pHTemp
°C
Retinoic acid receptor RXR-alpha
(Homo sapiens (Human))
BDBM50218478
(4-{2-[2-(4-fluoro-phenyl)-acetylamino]-7,7,10,10-t...)
Show SMILES CCCN1c2ccc(NC(=O)Cc3ccc(F)cc3)cc2N=C(c2ccc(cc2)C(O)=O)c2cc3c(cc12)C(C)(C)CCC3(C)C |t:23|
Show InChI InChI=1S/C39H40FN3O3/c1-6-19-43-33-16-15-28(41-35(44)20-24-7-13-27(40)14-8-24)21-32(33)42-36(25-9-11-26(12-10-25)37(45)46)29-22-30-31(23-34(29)43)39(4,5)18-17-38(30,2)3/h7-16,21-23H,6,17-20H2,1-5H3,(H,41,44)(H,45,46)
NCI pathway
Reactome pathway
n/an/a 3.10E+3n/an/an/an/an/an/a
Tsukuba Research Institute
Curated by ChEMBL
Assay Description
Antagonist activity at human RXRalpha expressed in EK293 cells assessed as inhibition of 9-cis-retinoic acid-induced transactivation
Bioorg Med Chem Lett 17: 4808-11 (2007)
Article DOI: 10.1016/j.bmcl.2007.06.079
BindingDB Entry DOI: 10.7270/Q2V40TWB
Retinoic acid receptor RXR-alpha
(Homo sapiens (Human))
BDBM50218478
(4-{2-[2-(4-fluoro-phenyl)-acetylamino]-7,7,10,10-t...)
Show SMILES CCCN1c2ccc(NC(=O)Cc3ccc(F)cc3)cc2N=C(c2ccc(cc2)C(O)=O)c2cc3c(cc12)C(C)(C)CCC3(C)C |t:23|
Show InChI InChI=1S/C39H40FN3O3/c1-6-19-43-33-16-15-28(41-35(44)20-24-7-13-27(40)14-8-24)21-32(33)42-36(25-9-11-26(12-10-25)37(45)46)29-22-30-31(23-34(29)43)39(4,5)18-17-38(30,2)3/h7-16,21-23H,6,17-20H2,1-5H3,(H,41,44)(H,45,46)
NCI pathway
Reactome pathway
n/an/a 3.90E+3n/an/an/an/an/an/a
Tsukuba Research Institute
Curated by ChEMBL
Assay Description
Antagonist activity at human RXRalpha expressed in EK293 cells assessed as inhibition of LG100268-induced transactivation
Bioorg Med Chem Lett 17: 4808-11 (2007)
Article DOI: 10.1016/j.bmcl.2007.06.079
BindingDB Entry DOI: 10.7270/Q2V40TWB