BDBM50219036 CHEMBL388440::N-{3-[1-(3-{[hydroxy(diphenyl)acetyl]amino}propyl)-4-piperidinyl]-4-methylphenyl}-2-methylpropanamide
SMILES: CC(C)C(=O)Nc1ccc(C)c(c1)C1CCN(CCCNC(=O)C(O)(c2ccccc2)c2ccccc2)CC1
InChI Key: InChIKey=INMZLZRTJQLJQQ-UHFFFAOYSA-N
Data: 1 KI  1 IC50
Activity Spreadsheet -- Enzyme Inhibition Constant Data from BindingDB
Found 2 hits for monomerid = 50219036
Trg + Lig
Ki
nM
ΔG°
kcal/mole
IC50
nM
Kd
nM
EC50/IC50
nM
koff
s-1
kon
M-1s-1
pHTemp
°C
GPR24
(RAT)
BDBM50219036
(CHEMBL388440 | N-{3-[1-(3-{[hydroxy(diphenyl)acety...)
Show SMILES CC(C)C(=O)Nc1ccc(C)c(c1)C1CCN(CCCNC(=O)C(O)(c2ccccc2)c2ccccc2)CC1
Show InChI InChI=1S/C33H41N3O3/c1-24(2)31(37)35-29-16-15-25(3)30(23-29)26-17-21-36(22-18-26)20-10-19-34-32(38)33(39,27-11-6-4-7-12-27)28-13-8-5-9-14-28/h4-9,11-16,23-24,26,39H,10,17-22H2,1-3H3,(H,34,38)(H,35,37)
Reactome pathway
0.600n/an/an/an/an/an/an/an/a
Lundbeck Research USA, Inc.
Curated by ChEMBL
Assay Description
Displacement of [3H]SNAP 7941 from rat MCHR1 expressed in HEK293 cells
J Med Chem 50: 3870-82 (2007)
Article DOI: 10.1021/jm060381c
BindingDB Entry DOI: 10.7270/Q2930SWM
GPR24
(RAT)
BDBM50219036
(CHEMBL388440 | N-{3-[1-(3-{[hydroxy(diphenyl)acety...)
Show SMILES CC(C)C(=O)Nc1ccc(C)c(c1)C1CCN(CCCNC(=O)C(O)(c2ccccc2)c2ccccc2)CC1
Show InChI InChI=1S/C33H41N3O3/c1-24(2)31(37)35-29-16-15-25(3)30(23-29)26-17-21-36(22-18-26)20-10-19-34-32(38)33(39,27-11-6-4-7-12-27)28-13-8-5-9-14-28/h4-9,11-16,23-24,26,39H,10,17-22H2,1-3H3,(H,34,38)(H,35,37)
Reactome pathway
n/an/a 27n/an/an/an/an/an/a
Lundbeck Research USA, Inc.
Curated by ChEMBL
Assay Description
Antagonist activity at rat MCHR1 expressed in HEK293 cells assessed as effect on calcium mobilization
J Med Chem 50: 3870-82 (2007)
Article DOI: 10.1021/jm060381c
BindingDB Entry DOI: 10.7270/Q2930SWM