BDBM50220629 4'-(3-hydroxy-2,4-dimethyl-5-oxo-2,5-dihydro-thiophen-2-ylmethyl)-biphenyl-4-carboxylic acid::CHEMBL250429
SMILES: CC1C(=O)SC(C)(Cc2ccc(cc2)-c2ccc(cc2)C(O)=O)C1=O
InChI Key: InChIKey=IEJPCOBEYSXVIR-UHFFFAOYSA-N
Data: 1 IC50
Activity Spreadsheet -- Enzyme Inhibition Constant Data from BindingDB
Found 1 hit for monomerid = 50220629
Trg + Lig
Ki
nM
ΔG°
kcal/mole
IC50
nM
Kd
nM
EC50/IC50
nM
koff
s-1
kon
M-1s-1
pHTemp
°C
3-oxoacyl-[acyl-carrier-protein] synthase 3
(Mycobacterium tuberculosis)
BDBM50220629
(4'-(3-hydroxy-2,4-dimethyl-5-oxo-2,5-dihydro-thiop...)
Show SMILES CC1C(=O)SC(C)(Cc2ccc(cc2)-c2ccc(cc2)C(O)=O)C1=O
Show InChI InChI=1S/C20H18O4S/c1-12-17(21)20(2,25-19(12)24)11-13-3-5-14(6-4-13)15-7-9-16(10-8-15)18(22)23/h3-10,12H,11H2,1-2H3,(H,22,23)
n/an/a 7.00E+3n/an/an/an/an/an/a
University of Birmingham
Curated by ChEMBL
Assay Description
Inhibition of Mycobacterium tuberculosis FabH
Bioorg Med Chem Lett 17: 5643-6 (2007)
Article DOI: 10.1016/j.bmcl.2007.07.082
BindingDB Entry DOI: 10.7270/Q2QF8TPJ