BDBM50220959 1-[(R)-8-chloro-3-(3-morpholin-4-yl-propyl)-3-phenyl-3a,4-dihydro-3H-5-oxa-1,9b-diaza-cyclopenta[a]naphthalen-2-yl]-ethanone::CHEMBL250533
SMILES: CC(=O)C1=NN2[C@@H](COc3ccc(Cl)cc23)C1(CCCN1CCOCC1)c1ccccc1
InChI Key: InChIKey=CMBQRLAOLALFJJ-LFQPHHBNSA-N
Data: 2 IC50
Activity Spreadsheet -- Enzyme Inhibition Constant Data from BindingDB
Found 2 hits for monomerid = 50220959
Trg + Lig
Ki
nM
ΔG°
kcal/mole
IC50
nM
Kd
nM
EC50/IC50
nM
koff
s-1
kon
M-1s-1
pHTemp
°C
Potassium voltage-gated channel subfamily H member 2
(Homo sapiens (Human))
BDBM50220959
(1-[(R)-8-chloro-3-(3-morpholin-4-yl-propyl)-3-phen...)
Show SMILES CC(=O)C1=NN2[C@@H](COc3ccc(Cl)cc23)C1(CCCN1CCOCC1)c1ccccc1 |t:3|
Show InChI InChI=1S/C25H28ClN3O3/c1-18(30)24-25(19-6-3-2-4-7-19,10-5-11-28-12-14-31-15-13-28)23-17-32-22-9-8-20(26)16-21(22)29(23)27-24/h2-4,6-9,16,23H,5,10-15,17H2,1H3/t23-,25?/m0/s1
Reactome pathway
n/an/a 3.30E+3n/an/an/an/an/an/a
Merck Research Laboratories
Curated by ChEMBL
Assay Description
Inhibition of hERG expressed in HEK cells
Bioorg Med Chem Lett 17: 5671-6 (2007)
Article DOI: 10.1016/j.bmcl.2007.07.067
BindingDB Entry DOI: 10.7270/Q261101N
Kinesin-like protein 1
(Homo sapiens (Human))
BDBM50220959
(1-[(R)-8-chloro-3-(3-morpholin-4-yl-propyl)-3-phen...)
Show SMILES CC(=O)C1=NN2[C@@H](COc3ccc(Cl)cc23)C1(CCCN1CCOCC1)c1ccccc1 |t:3|
Show InChI InChI=1S/C25H28ClN3O3/c1-18(30)24-25(19-6-3-2-4-7-19,10-5-11-28-12-14-31-15-13-28)23-17-32-22-9-8-20(26)16-21(22)29(23)27-24/h2-4,6-9,16,23H,5,10-15,17H2,1H3/t23-,25?/m0/s1
Reactome pathway
n/an/a 1.80n/an/an/an/an/an/a
Merck Research Laboratories
Curated by ChEMBL
Assay Description
Inhibition of kinesin spindle protein
Bioorg Med Chem Lett 17: 5671-6 (2007)
Article DOI: 10.1016/j.bmcl.2007.07.067
BindingDB Entry DOI: 10.7270/Q261101N