null
SMILES: [O-]C(=O)CC[C@H](NP([O-])(=O)OC[C@H](NC(=O)c1ccccc1)C([O-])=O)C([O-])=O
InChI Key: InChIKey=FMKMCQXFKJRGIQ-QWRGUYRKSA-J
Activity Spreadsheet -- Enzyme Inhibition Constant Data from BindingDB
Found 1 hit for monomerid = 50222550
Trg + Lig
Ki
nM
ΔG°
kcal/mole
IC50
nM
Kd
nM
EC50/IC50
nM
koff
s-1
kon
M-1s-1
pHTemp
°C
Glutamate carboxypeptidase 2
(Homo sapiens (Human))
BDBM50222550
(CHEMBL239882 | tetrapotassium (3S,8S)-6-oxido-1-ox...)
Show SMILES [O-]C(=O)CC[C@H](NP([O-])(=O)OC[C@H](NC(=O)c1ccccc1)C([O-])=O)C([O-])=O
Show InChI InChI=1S/C15H19N2O10P/c18-12(19)7-6-10(14(21)22)17-28(25,26)27-8-11(15(23)24)16-13(20)9-4-2-1-3-5-9/h1-5,10-11H,6-8H2,(H,16,20)(H,18,19)(H,21,22)(H,23,24)(H2,17,25,26)/p-4/t10-,11-/m0/s1
n/an/a 35n/an/an/an/an/an/a
San Francisco State University
Curated by ChEMBL
Assay Description
Inhibition of PSMA
Bioorg Med Chem 15: 7434-43 (2007)
Article DOI: 10.1016/j.bmc.2007.07.028
BindingDB Entry DOI: 10.7270/Q2057FMF