BDBM50222858 6-(4-fluorophenoxy)-2-isopropyl-3-[(1-isopropylpiperidin-3-yl)methyl]quinazolin-4(3H)-one::CHEMBL242566
SMILES: CC(C)N1CCC[C@H](Cn2c(nc3ccc(Oc4ccc(F)cc4)cc3c2=O)C(C)C)C1
InChI Key: InChIKey=ILNPGICYVIKHNL-IBGZPJMESA-N
Data: 2 KI  1 IC50
Activity Spreadsheet -- Enzyme Inhibition Constant Data from BindingDB
Found 3 hits for monomerid = 50222858
Trg + Lig
Ki
nM
ΔG°
kcal/mole
IC50
nM
Kd
nM
EC50/IC50
nM
koff
s-1
kon
M-1s-1
pHTemp
°C
Ghrelin receptor
(Ovis aries)
BDBM50222858
(6-(4-fluorophenoxy)-2-isopropyl-3-[(1-isopropylpip...)
Show SMILES CC(C)N1CCC[C@H](Cn2c(nc3ccc(Oc4ccc(F)cc4)cc3c2=O)C(C)C)C1
Show InChI InChI=1S/C26H32FN3O2/c1-17(2)25-28-24-12-11-22(32-21-9-7-20(27)8-10-21)14-23(24)26(31)30(25)16-19-6-5-13-29(15-19)18(3)4/h7-12,14,17-19H,5-6,13,15-16H2,1-4H3/t19-/m0/s1
4n/an/an/an/an/an/an/an/a
Bayer Pharmaceuticals Corporation
Curated by ChEMBL
Assay Description
Displacement of [125I]ghrelin from ovine recombinant GHSR1a expressed in HEK293F cells after 6 hrs by scintillation proximity assay
J Med Chem 50: 5202-16 (2007)
Article DOI: 10.1021/jm070071+
BindingDB Entry DOI: 10.7270/Q2WH2QT2
5-hydroxytryptamine receptor 2C
(Homo sapiens (Human))
BDBM50222858
(6-(4-fluorophenoxy)-2-isopropyl-3-[(1-isopropylpip...)
Show SMILES CC(C)N1CCC[C@H](Cn2c(nc3ccc(Oc4ccc(F)cc4)cc3c2=O)C(C)C)C1
Show InChI InChI=1S/C26H32FN3O2/c1-17(2)25-28-24-12-11-22(32-21-9-7-20(27)8-10-21)14-23(24)26(31)30(25)16-19-6-5-13-29(15-19)18(3)4/h7-12,14,17-19H,5-6,13,15-16H2,1-4H3/t19-/m0/s1
Reactome pathway
>1.00E+3n/an/an/an/an/an/an/an/a
Bayer Pharmaceuticals Corporation
Curated by ChEMBL
Assay Description
Displacement of [125I]DIO from 5HT2c receptor
J Med Chem 50: 5202-16 (2007)
Article DOI: 10.1021/jm070071+
BindingDB Entry DOI: 10.7270/Q2WH2QT2
Cytochrome P450 2D6
(Homo sapiens (Human))
BDBM50222858
(6-(4-fluorophenoxy)-2-isopropyl-3-[(1-isopropylpip...)
Show SMILES CC(C)N1CCC[C@H](Cn2c(nc3ccc(Oc4ccc(F)cc4)cc3c2=O)C(C)C)C1
Show InChI InChI=1S/C26H32FN3O2/c1-17(2)25-28-24-12-11-22(32-21-9-7-20(27)8-10-21)14-23(24)26(31)30(25)16-19-6-5-13-29(15-19)18(3)4/h7-12,14,17-19H,5-6,13,15-16H2,1-4H3/t19-/m0/s1
n/an/a 7.20E+3n/an/an/an/an/an/a
Bayer Pharmaceuticals Corporation
Curated by ChEMBL
Assay Description
Inhibition of CYP2D6
J Med Chem 50: 5202-16 (2007)
Article DOI: 10.1021/jm070071+
BindingDB Entry DOI: 10.7270/Q2WH2QT2