BDBM50223484 6-(3-aminopropyl)-4-(3-hydroxyphenyl)-9-(1H-pyrazol-4-yl)benzo[h]isoquinolin-1(2H)-one::CHEMBL249441
SMILES: NCCCc1cc2c(c[nH]c(=O)c2c2cc(ccc12)-c1cn[nH]c1)-c1cccc(O)c1
InChI Key: InChIKey=BUSJQQYKXHYDNN-UHFFFAOYSA-N
Data: 1 IC50
PDB links: 1 PDB ID matches this monomer.
Activity Spreadsheet -- Enzyme Inhibition Constant Data from BindingDB
Found 1 hit for monomerid = 50223484
Trg + Lig
Ki
nM
ΔG°
kcal/mole
IC50
nM
Kd
nM
EC50/IC50
nM
koff
s-1
kon
M-1s-1
pHTemp
°C
Serine/threonine-protein kinase Chk1
(Homo sapiens (Human))
BDBM50223484
(6-(3-aminopropyl)-4-(3-hydroxyphenyl)-9-(1H-pyrazo...)
Show SMILES NCCCc1cc2c(c[nH]c(=O)c2c2cc(ccc12)-c1cn[nH]c1)-c1cccc(O)c1
Show InChI InChI=1S/C25H22N4O2/c26-8-2-4-17-11-22-23(16-3-1-5-19(30)9-16)14-27-25(31)24(22)21-10-15(6-7-20(17)21)18-12-28-29-13-18/h1,3,5-7,9-14,30H,2,4,8,26H2,(H,27,31)(H,28,29)
Reactome pathway
n/an/a 1n/an/an/an/an/an/a
Merck Research Laboratories
Curated by ChEMBL
Assay Description
Inhibition of human Chk1 expressed in baculovirus by time-resolved fluorescence assay
Bioorg Med Chem Lett 17: 6280-5 (2007)
Article DOI: 10.1016/j.bmcl.2007.09.007
BindingDB Entry DOI: 10.7270/Q2W958ZJ
3D
3D Structure (crystal)