BDBM50224009 CHEMBL250409::N-(tert-butyl)-4-[5-(pyridin-2-ylamino)quinolin-3-yl]benzenesulfonamide::N-tert-butyl-4-(5-(pyridin-2-ylamino)quinolin-3-yl)benzenesulfonamide
SMILES: CC(C)(C)NS(=O)(=O)c1ccc(cc1)-c1cnc2cccc(Nc3ccccn3)c2c1
InChI Key: InChIKey=GJTCKUKIFXWJKG-UHFFFAOYSA-N
Data: 1 IC50
PDB links: 1 PDB ID matches this monomer.
Activity Spreadsheet -- Enzyme Inhibition Constant Data from BindingDB
Found 1 hit for monomerid = 50224009
Trg + Lig
Ki
nM
ΔG°
kcal/mole
IC50
nM
Kd
nM
EC50/IC50
nM
koff
s-1
kon
M-1s-1
pHTemp
°C
Mitogen-activated protein kinase 10
(Homo sapiens (Human))
BDBM50224009
(CHEMBL250409 | N-(tert-butyl)-4-[5-(pyridin-2-ylam...)
Show SMILES CC(C)(C)NS(=O)(=O)c1ccc(cc1)-c1cnc2cccc(Nc3ccccn3)c2c1
Show InChI InChI=1S/C24H24N4O2S/c1-24(2,3)28-31(29,30)19-12-10-17(11-13-19)18-15-20-21(26-16-18)7-6-8-22(20)27-23-9-4-5-14-25-23/h4-16,28H,1-3H3,(H,25,27)
NCI pathway
Reactome pathway
n/an/a 150n/an/an/an/an/an/a
Scripps Florida
Curated by ChEMBL
Assay Description
Inhibition of JNK3 by HTRF assay
Bioorg Med Chem Lett 17: 6378-82 (2007)
Article DOI: 10.1016/j.bmcl.2007.08.054
BindingDB Entry DOI: 10.7270/Q26M36KX
3D
3D Structure (crystal)