BDBM50229063 CHEMBL161189
SMILES: CCCCc1noc(n1)C1=CC(C)CNC1
InChI Key: InChIKey=WCENAKFFYLPIPK-UHFFFAOYSA-N
Data: 2 IC50  1 EC50
Activity Spreadsheet -- Enzyme Inhibition Constant Data from BindingDB
Found 3 hits for monomerid = 50229063
Trg + Lig
Ki
nM
ΔG°
kcal/mole
IC50
nM
Kd
nM
EC50/IC50
nM
koff
s-1
kon
M-1s-1
pHTemp
°C
Muscarinic acetylcholine receptor
(RAT)
BDBM50229063
(CHEMBL161189)
Show SMILES CCCCc1noc(n1)C1=CC(C)CNC1 |t:10|
Show InChI InChI=1S/C12H19N3O/c1-3-4-5-11-14-12(16-15-11)10-6-9(2)7-13-8-10/h6,9,13H,3-5,7-8H2,1-2H3
NCI pathway
Reactome pathway
n/an/a 685n/an/an/an/an/an/a
Ferrosan A/S
Curated by ChEMBL
Assay Description
In vitro binding affinity to muscarinic acetylcholine receptor site in rat brain assayed using [3H]oxotremorine-M as the radioligand.
J Med Chem 34: 687-92 (1991)
BindingDB Entry DOI: 10.7270/Q2RN3B25
Muscarinic acetylcholine receptor
(Homo sapiens (Human))
BDBM50229063
(CHEMBL161189)
Show SMILES CCCCc1noc(n1)C1=CC(C)CNC1 |t:10|
Show InChI InChI=1S/C12H19N3O/c1-3-4-5-11-14-12(16-15-11)10-6-9(2)7-13-8-10/h6,9,13H,3-5,7-8H2,1-2H3
NCI pathway
Reactome pathway
n/an/an/an/a>3.00E+4n/an/an/an/a
Ferrosan A/S
Curated by ChEMBL
Assay Description
Agonist activity at muscarinic acetylcholine receptor in isolated guinea pig ileum.
J Med Chem 34: 687-92 (1991)
BindingDB Entry DOI: 10.7270/Q2RN3B25
Muscarinic acetylcholine receptor
(RAT)
BDBM50229063
(CHEMBL161189)
Show SMILES CCCCc1noc(n1)C1=CC(C)CNC1 |t:10|
Show InChI InChI=1S/C12H19N3O/c1-3-4-5-11-14-12(16-15-11)10-6-9(2)7-13-8-10/h6,9,13H,3-5,7-8H2,1-2H3
NCI pathway
Reactome pathway
n/an/a 6.43E+4n/an/an/an/an/an/a
Ferrosan A/S
Curated by ChEMBL
Assay Description
In Vitro binding affinity to the muscarinic acetylcholine receptor site in rat brain by using [3H]QNB as the radioligand.
J Med Chem 34: 687-92 (1991)
BindingDB Entry DOI: 10.7270/Q2RN3B25