BDBM50229065 CHEMBL262517
SMILES: OC(=O)C(O)=O.CN1CCC=C(C1)c1nc(no1)C(C)(C)C
InChI Key: InChIKey=SDKUJZYBNNRZJT-UHFFFAOYSA-N
Data: 2 IC50  1 EC50
Activity Spreadsheet -- Enzyme Inhibition Constant Data from BindingDB
Found 3 hits for monomerid = 50229065
Trg + Lig
Ki
nM
ΔG°
kcal/mole
IC50
nM
Kd
nM
EC50/IC50
nM
koff
s-1
kon
M-1s-1
pHTemp
°C
Muscarinic acetylcholine receptor
(RAT)
BDBM50229065
(CHEMBL262517)
Show SMILES OC(=O)C(O)=O.CN1CCC=C(C1)c1nc(no1)C(C)(C)C |c:9|
Show InChI InChI=1S/C12H19N3O/c1-12(2,3)11-13-10(16-14-11)9-6-5-7-15(4)8-9/h6H,5,7-8H2,1-4H3
NCI pathway
Reactome pathway
n/an/a 286n/an/an/an/an/an/a
Ferrosan A/S
Curated by ChEMBL
Assay Description
In vitro binding affinity to muscarinic acetylcholine receptor site in rat brain assayed using [3H]oxotremorine-M as the radioligand.
J Med Chem 34: 687-92 (1991)
BindingDB Entry DOI: 10.7270/Q2RN3B25
Muscarinic acetylcholine receptor
(RAT)
BDBM50229065
(CHEMBL262517)
Show SMILES OC(=O)C(O)=O.CN1CCC=C(C1)c1nc(no1)C(C)(C)C |c:9|
Show InChI InChI=1S/C12H19N3O/c1-12(2,3)11-13-10(16-14-11)9-6-5-7-15(4)8-9/h6H,5,7-8H2,1-4H3
NCI pathway
Reactome pathway
n/an/a 9.00E+3n/an/an/an/an/an/a
Ferrosan A/S
Curated by ChEMBL
Assay Description
In Vitro binding affinity to the muscarinic acetylcholine receptor site in rat brain by using [3H]QNB as the radioligand.
J Med Chem 34: 687-92 (1991)
BindingDB Entry DOI: 10.7270/Q2RN3B25
Muscarinic acetylcholine receptor
(Homo sapiens (Human))
BDBM50229065
(CHEMBL262517)
Show SMILES OC(=O)C(O)=O.CN1CCC=C(C1)c1nc(no1)C(C)(C)C |c:9|
Show InChI InChI=1S/C12H19N3O/c1-12(2,3)11-13-10(16-14-11)9-6-5-7-15(4)8-9/h6H,5,7-8H2,1-4H3
NCI pathway
Reactome pathway
n/an/an/an/a>3.00E+4n/an/an/an/a
Ferrosan A/S
Curated by ChEMBL
Assay Description
Agonist activity at muscarinic acetylcholine receptor in isolated guinea pig ileum.
J Med Chem 34: 687-92 (1991)
BindingDB Entry DOI: 10.7270/Q2RN3B25