BDBM50229666 (2S,3S)-2-((S)-1-((2S,3S)-2-amino-3-methylpentanoyl)pyrrolidine-5-carboxamido)-3-methylpentanoic acid::CHEMBL214381::Ile-Pro-Ile
SMILES: CC[C@H](C)[C@H](N)C(=O)N1CCC[C@H]1C(=O)N[C@@H]([C@@H](C)CC)C(O)=O
InChI Key: InChIKey=JNTMAZFVYNDPLB-PEDHHIEDSA-N
Data: 3 KI  4 IC50
Activity Spreadsheet -- Enzyme Inhibition Constant Data from BindingDB
Found 7 hits for monomerid = 50229666
Trg + Lig
Ki
nM
ΔG°
kcal/mole
IC50
nM
Kd
nM
EC50/IC50
nM
koff
s-1
kon
M-1s-1
pHTemp
°C
Dipeptidyl peptidase 4
(Homo sapiens (Human))
BDBM50229666
((2S,3S)-2-((S)-1-((2S,3S)-2-amino-3-methylpentanoy...)
Show SMILES CC[C@H](C)[C@H](N)C(=O)N1CCC[C@H]1C(=O)N[C@@H]([C@@H](C)CC)C(O)=O
Show InChI InChI=1S/C17H31N3O4/c1-5-10(3)13(18)16(22)20-9-7-8-12(20)15(21)19-14(17(23)24)11(4)6-2/h10-14H,5-9,18H2,1-4H3,(H,19,21)(H,23,24)/t10-,11-,12-,13-,14-/m0/s1
Reactome pathway
2.20E+3n/an/an/an/an/an/an/an/a
TBA
Curated by ChEMBL
Assay Description
Inhibition of DPP-4 (unknown origin) assessed as inhibition of endomorphin-2 degradation after 30 min
Med Chem Res 21: 1445-1450 (2012)
Article DOI: 10.1007/s00044-011-9666-5
BindingDB Entry DOI: 10.7270/Q2NP27BJ
Dipeptidyl peptidase 4
(Homo sapiens (Human))
BDBM50229666
((2S,3S)-2-((S)-1-((2S,3S)-2-amino-3-methylpentanoy...)
Show SMILES CC[C@H](C)[C@H](N)C(=O)N1CCC[C@H]1C(=O)N[C@@H]([C@@H](C)CC)C(O)=O
Show InChI InChI=1S/C17H31N3O4/c1-5-10(3)13(18)16(22)20-9-7-8-12(20)15(21)19-14(17(23)24)11(4)6-2/h10-14H,5-9,18H2,1-4H3,(H,19,21)(H,23,24)/t10-,11-,12-,13-,14-/m0/s1
Reactome pathway
2.20E+3n/an/an/an/an/an/an/an/a
TBA
Curated by ChEMBL
Assay Description
Inhibition of DPP-4 (unknown origin) assessed as inhibition of endomorphin-1 degradation after 30 min
Med Chem Res 21: 1445-1450 (2012)
Article DOI: 10.1007/s00044-011-9666-5
BindingDB Entry DOI: 10.7270/Q2NP27BJ
Dipeptidyl peptidase VIII
(Homo sapiens (Human))
BDBM50229666
((2S,3S)-2-((S)-1-((2S,3S)-2-amino-3-methylpentanoy...)
Show SMILES CC[C@H](C)[C@H](N)C(=O)N1CCC[C@H]1C(=O)N[C@@H]([C@@H](C)CC)C(O)=O
Show InChI InChI=1S/C17H31N3O4/c1-5-10(3)13(18)16(22)20-9-7-8-12(20)15(21)19-14(17(23)24)11(4)6-2/h10-14H,5-9,18H2,1-4H3,(H,19,21)(H,23,24)/t10-,11-,12-,13-,14-/m0/s1
3.90E+4n/an/an/an/an/an/an/an/a
TBA
Curated by ChEMBL
Assay Description
Inhibition of human recombinant DPP8 assessed as Gly-Pro-pNA chromogrnic substrate cleavage for 16 mins preincubated with compound for 10 mins before...
ACS Med Chem Lett 1: 530-535 (2010)
Article DOI: 10.1021/ml100200c
BindingDB Entry DOI: 10.7270/Q2513ZGH
Dipeptidyl peptidase IV
(Sus scrofa (pig))
BDBM50229666
((2S,3S)-2-((S)-1-((2S,3S)-2-amino-3-methylpentanoy...)
Show SMILES CC[C@H](C)[C@H](N)C(=O)N1CCC[C@H]1C(=O)N[C@@H]([C@@H](C)CC)C(O)=O
Show InChI InChI=1S/C17H31N3O4/c1-5-10(3)13(18)16(22)20-9-7-8-12(20)15(21)19-14(17(23)24)11(4)6-2/h10-14H,5-9,18H2,1-4H3,(H,19,21)(H,23,24)/t10-,11-,12-,13-,14-/m0/s1
Reactome pathway
n/an/a 1.44E+4n/an/an/an/an/an/a
St. John's University
Curated by ChEMBL
Assay Description
Inhibition of pig DPP4
Bioorg Med Chem Lett 18: 479-84 (2008)
Article DOI: 10.1016/j.bmcl.2007.11.107
BindingDB Entry DOI: 10.7270/Q27W6BX8
Dipeptidyl peptidase 4
(Homo sapiens (Human))
BDBM50229666
((2S,3S)-2-((S)-1-((2S,3S)-2-amino-3-methylpentanoy...)
Show SMILES CC[C@H](C)[C@H](N)C(=O)N1CCC[C@H]1C(=O)N[C@@H]([C@@H](C)CC)C(O)=O
Show InChI InChI=1S/C17H31N3O4/c1-5-10(3)13(18)16(22)20-9-7-8-12(20)15(21)19-14(17(23)24)11(4)6-2/h10-14H,5-9,18H2,1-4H3,(H,19,21)(H,23,24)/t10-,11-,12-,13-,14-/m0/s1
Reactome pathway
n/an/a 4.21E+3n/an/an/an/an/an/a
Chinese Academy of Sciences
Curated by ChEMBL
Assay Description
Inhibition of DPP4 (unknown origin) using Gly-Pro-AMC as substrate preincubated for 4 secs followed by substrate addition and measured after 30 mins ...
Eur J Med Chem 151: 145-157 (2018)
Article DOI: 10.1016/j.ejmech.2018.03.041
BindingDB Entry DOI: 10.7270/Q2CZ39SV
Dipeptidyl peptidase 4
(Homo sapiens (Human))
BDBM50229666
((2S,3S)-2-((S)-1-((2S,3S)-2-amino-3-methylpentanoy...)
Show SMILES CC[C@H](C)[C@H](N)C(=O)N1CCC[C@H]1C(=O)N[C@@H]([C@@H](C)CC)C(O)=O
Show InChI InChI=1S/C17H31N3O4/c1-5-10(3)13(18)16(22)20-9-7-8-12(20)15(21)19-14(17(23)24)11(4)6-2/h10-14H,5-9,18H2,1-4H3,(H,19,21)(H,23,24)/t10-,11-,12-,13-,14-/m0/s1
Reactome pathway
n/an/a 2.53E+3n/an/an/an/an/an/a
TBA
Curated by ChEMBL
Assay Description
Inhibition of DPP4 in human plasma using Gly-Pro-AMC substrate incubated for 20 mins by fluorometry
Bioorg Med Chem 22: 6515-22 (2015)
Article DOI: 10.1016/j.bmc.2014.06.051
BindingDB Entry DOI: 10.7270/Q21Z4611
Dipeptidyl peptidase 4
(Homo sapiens (Human))
BDBM50229666
((2S,3S)-2-((S)-1-((2S,3S)-2-amino-3-methylpentanoy...)
Show SMILES CC[C@H](C)[C@H](N)C(=O)N1CCC[C@H]1C(=O)N[C@@H]([C@@H](C)CC)C(O)=O
Show InChI InChI=1S/C17H31N3O4/c1-5-10(3)13(18)16(22)20-9-7-8-12(20)15(21)19-14(17(23)24)11(4)6-2/h10-14H,5-9,18H2,1-4H3,(H,19,21)(H,23,24)/t10-,11-,12-,13-,14-/m0/s1
Reactome pathway
n/an/a 3.00E+3n/an/an/an/an/an/a
TBA
Curated by ChEMBL
Assay Description
Inhibition of human recombinant DPP4 assessed as Gly-Pro-pNA chromogrnic substrate cleavage for 16 mins preincubated with compound for 10 mins before...
ACS Med Chem Lett 1: 530-535 (2010)
Article DOI: 10.1021/ml100200c
BindingDB Entry DOI: 10.7270/Q2513ZGH