BDBM16753 2-[2-(2-chlorophenyl)-5-[4-(4-acetylphenoxy)phenyl]-1H-pyrrol-1-yl]-N-(diaminomethylidene)acetamide::Acylguanidine, 7c::CHEMBL253237::N-{2-[2-[4-(4-Acetyl-phenoxy)-phenyl]-5-(2-chloro-phenyl)-pyrrol-1-yl]-acetyl}-guanidine
SMILES: CC(=O)c1ccc(Oc2ccc(cc2)-c2ccc(-c3ccccc3Cl)n2CC(=O)NC(N)=N)cc1
InChI Key: InChIKey=MIEKBLPHNQZVQQ-UHFFFAOYSA-N
Data: 9 IC50
PDB links: 1 PDB ID matches this monomer.
Activity Spreadsheet -- Enzyme Inhibition Constant Data from BindingDB
Found 9 hits for monomerid = 16753
Trg + Lig
Ki
nM
ΔG°
kcal/mole
IC50
nM
Kd
nM
EC50/IC50
nM
koff
s-1
kon
M-1s-1
pHTemp
°C
Beta-secretase 1
(Homo sapiens (Human))
BDBM16753
(2-[2-(2-chlorophenyl)-5-[4-(4-acetylphenoxy)phenyl...)
Show SMILES CC(=O)c1ccc(Oc2ccc(cc2)-c2ccc(-c3ccccc3Cl)n2CC(=O)NC(N)=N)cc1
Show InChI InChI=1S/C27H23ClN4O3/c1-17(33)18-6-10-20(11-7-18)35-21-12-8-19(9-13-21)24-14-15-25(22-4-2-3-5-23(22)28)32(24)16-26(34)31-27(29)30/h2-15H,16H2,1H3,(H4,29,30,31,34)
n/an/a 160n/an/an/an/a4.522
Wyeth Research
Assay Description
A homogenous, continuous fluorescence resonance energy transfer (FRET) assay was used to assess compound inhibition of enzyme based on the cleavage o...
J Med Chem 49: 6158-61 (2006)
Article DOI: 10.1021/jm0607451
BindingDB Entry DOI: 10.7270/Q2M043NG
3D
3D Structure (crystal)
Beta-secretase 2
(Homo sapiens (Human))
BDBM16753
(2-[2-(2-chlorophenyl)-5-[4-(4-acetylphenoxy)phenyl...)
Show SMILES CC(=O)c1ccc(Oc2ccc(cc2)-c2ccc(-c3ccccc3Cl)n2CC(=O)NC(N)=N)cc1
Show InChI InChI=1S/C27H23ClN4O3/c1-17(33)18-6-10-20(11-7-18)35-21-12-8-19(9-13-21)24-14-15-25(22-4-2-3-5-23(22)28)32(24)16-26(34)31-27(29)30/h2-15H,16H2,1H3,(H4,29,30,31,34)
n/an/a 3.20E+3n/an/an/an/a4.522
Wyeth Research
Assay Description
A homogenous, continuous fluorescence resonance energy transfer (FRET) assay was used to assess compound inhibition of enzyme based on the cleavage o...
J Med Chem 49: 6158-61 (2006)
Article DOI: 10.1021/jm0607451
BindingDB Entry DOI: 10.7270/Q2M043NG
Cathepsin D
(Homo sapiens (Human))
BDBM16753
(2-[2-(2-chlorophenyl)-5-[4-(4-acetylphenoxy)phenyl...)
Show SMILES CC(=O)c1ccc(Oc2ccc(cc2)-c2ccc(-c3ccccc3Cl)n2CC(=O)NC(N)=N)cc1
Show InChI InChI=1S/C27H23ClN4O3/c1-17(33)18-6-10-20(11-7-18)35-21-12-8-19(9-13-21)24-14-15-25(22-4-2-3-5-23(22)28)32(24)16-26(34)31-27(29)30/h2-15H,16H2,1H3,(H4,29,30,31,34)
NCI pathway
Reactome pathway
n/an/a 8.20E+3n/an/an/an/a4.522
Wyeth Research
Assay Description
A homogenous, continuous fluorescence resonance energy transfer (FRET) assay was used to assess compound inhibition of enzyme based on the cleavage o...
J Med Chem 49: 6158-61 (2006)
Article DOI: 10.1021/jm0607451
BindingDB Entry DOI: 10.7270/Q2M043NG
Pepsin
(Homo sapiens (Human))
BDBM16753
(2-[2-(2-chlorophenyl)-5-[4-(4-acetylphenoxy)phenyl...)
Show SMILES CC(=O)c1ccc(Oc2ccc(cc2)-c2ccc(-c3ccccc3Cl)n2CC(=O)NC(N)=N)cc1
Show InChI InChI=1S/C27H23ClN4O3/c1-17(33)18-6-10-20(11-7-18)35-21-12-8-19(9-13-21)24-14-15-25(22-4-2-3-5-23(22)28)32(24)16-26(34)31-27(29)30/h2-15H,16H2,1H3,(H4,29,30,31,34)
n/an/a>5.00E+4n/an/an/an/a4.522
Wyeth Research
Assay Description
A homogenous, continuous fluorescence resonance energy transfer (FRET) assay was used to assess compound inhibition of enzyme based on the cleavage o...
J Med Chem 49: 6158-61 (2006)
Article DOI: 10.1021/jm0607451
BindingDB Entry DOI: 10.7270/Q2M043NG
Beta-secretase 2
(Homo sapiens (Human))
BDBM16753
(2-[2-(2-chlorophenyl)-5-[4-(4-acetylphenoxy)phenyl...)
Show SMILES CC(=O)c1ccc(Oc2ccc(cc2)-c2ccc(-c3ccccc3Cl)n2CC(=O)NC(N)=N)cc1
Show InChI InChI=1S/C27H23ClN4O3/c1-17(33)18-6-10-20(11-7-18)35-21-12-8-19(9-13-21)24-14-15-25(22-4-2-3-5-23(22)28)32(24)16-26(34)31-27(29)30/h2-15H,16H2,1H3,(H4,29,30,31,34)
n/an/a 2.30E+3n/an/an/an/an/an/a
Wyeth Research
Curated by ChEMBL
Assay Description
Inhibition of BACE2
Bioorg Med Chem Lett 18: 1063-6 (2008)
Article DOI: 10.1016/j.bmcl.2007.12.010
BindingDB Entry DOI: 10.7270/Q22807CT
Beta-secretase 1
(Homo sapiens (Human))
BDBM16753
(2-[2-(2-chlorophenyl)-5-[4-(4-acetylphenoxy)phenyl...)
Show SMILES CC(=O)c1ccc(Oc2ccc(cc2)-c2ccc(-c3ccccc3Cl)n2CC(=O)NC(N)=N)cc1
Show InChI InChI=1S/C27H23ClN4O3/c1-17(33)18-6-10-20(11-7-18)35-21-12-8-19(9-13-21)24-14-15-25(22-4-2-3-5-23(22)28)32(24)16-26(34)31-27(29)30/h2-15H,16H2,1H3,(H4,29,30,31,34)
n/an/a 700n/an/an/an/an/an/a
Wyeth Research
Curated by ChEMBL
Assay Description
Inhibition of BACE1 by FRET assay
Bioorg Med Chem Lett 18: 1063-6 (2008)
Article DOI: 10.1016/j.bmcl.2007.12.010
BindingDB Entry DOI: 10.7270/Q22807CT
3D
3D Structure (crystal)
Beta-secretase 1
(Homo sapiens (Human))
BDBM16753
(2-[2-(2-chlorophenyl)-5-[4-(4-acetylphenoxy)phenyl...)
Show SMILES CC(=O)c1ccc(Oc2ccc(cc2)-c2ccc(-c3ccccc3Cl)n2CC(=O)NC(N)=N)cc1
Show InChI InChI=1S/C27H23ClN4O3/c1-17(33)18-6-10-20(11-7-18)35-21-12-8-19(9-13-21)24-14-15-25(22-4-2-3-5-23(22)28)32(24)16-26(34)31-27(29)30/h2-15H,16H2,1H3,(H4,29,30,31,34)
n/an/a 700n/an/an/an/an/an/a
Wyeth Research
Curated by ChEMBL
Assay Description
Inhibition of BACE1
Bioorg Med Chem Lett 18: 767-71 (2008)
Article DOI: 10.1016/j.bmcl.2007.11.043
BindingDB Entry DOI: 10.7270/Q27S7PK8
3D
3D Structure (crystal)
Cathepsin D
(Homo sapiens (Human))
BDBM16753
(2-[2-(2-chlorophenyl)-5-[4-(4-acetylphenoxy)phenyl...)
Show SMILES CC(=O)c1ccc(Oc2ccc(cc2)-c2ccc(-c3ccccc3Cl)n2CC(=O)NC(N)=N)cc1
Show InChI InChI=1S/C27H23ClN4O3/c1-17(33)18-6-10-20(11-7-18)35-21-12-8-19(9-13-21)24-14-15-25(22-4-2-3-5-23(22)28)32(24)16-26(34)31-27(29)30/h2-15H,16H2,1H3,(H4,29,30,31,34)
NCI pathway
Reactome pathway
n/an/a 1.89E+4n/an/an/an/an/an/a
Wyeth Research
Curated by ChEMBL
Assay Description
Inhibition of cathepsin D
Bioorg Med Chem Lett 18: 1063-6 (2008)
Article DOI: 10.1016/j.bmcl.2007.12.010
BindingDB Entry DOI: 10.7270/Q22807CT
Beta-secretase 1
(Homo sapiens (Human))
BDBM16753
(2-[2-(2-chlorophenyl)-5-[4-(4-acetylphenoxy)phenyl...)
Show SMILES CC(=O)c1ccc(Oc2ccc(cc2)-c2ccc(-c3ccccc3Cl)n2CC(=O)NC(N)=N)cc1
Show InChI InChI=1S/C27H23ClN4O3/c1-17(33)18-6-10-20(11-7-18)35-21-12-8-19(9-13-21)24-14-15-25(22-4-2-3-5-23(22)28)32(24)16-26(34)31-27(29)30/h2-15H,16H2,1H3,(H4,29,30,31,34)
n/an/a 3.80E+3n/an/an/an/an/an/a
Wyeth Research
Curated by ChEMBL
Assay Description
Inhibition of BACE1 assessed as reduction of total cellular amyloid beta formation by ELISA
Bioorg Med Chem Lett 18: 1063-6 (2008)
Article DOI: 10.1016/j.bmcl.2007.12.010
BindingDB Entry DOI: 10.7270/Q22807CT
3D
3D Structure (crystal)