BDBM50235147 VITALBOSIDE A::Vitalboside A
SMILES: [H][C@@]1(O[C@H]2CC[C@@]3(C)[C@@]([H])(CC[C@]4(C)[C@]3([H])CC=C3[C@]5([H])CC(C)(C)CC[C@@]5(CC[C@@]43C)C(O)=O)C2(C)C)O[C@H](CO)[C@@H](O)[C@H](O)[C@H]1O
InChI Key: InChIKey=ZNFRITHWVZXJRK-YHFBEQRYSA-N
Data: 1 IC50
Activity Spreadsheet -- Enzyme Inhibition Constant Data from BindingDB
Found 1 hit for monomerid = 50235147
Trg + Lig
Ki
nM
ΔG°
kcal/mole
IC50
nM
Kd
nM
EC50/IC50
nM
koff
s-1
kon
M-1s-1
pHTemp
°C
Coagulation factor VII/tissue factor
(Homo sapiens (Human))
BDBM50235147
(VITALBOSIDE A | Vitalboside A)
Show SMILES [H][C@@]1(O[C@H]2CC[C@@]3(C)[C@@]([H])(CC[C@]4(C)[C@]3([H])CC=C3[C@]5([H])CC(C)(C)CC[C@@]5(CC[C@@]43C)C(O)=O)C2(C)C)O[C@H](CO)[C@@H](O)[C@H](O)[C@H]1O |r,t:18|
Show InChI InChI=1S/C36H58O8/c1-31(2)14-16-36(30(41)42)17-15-34(6)20(21(36)18-31)8-9-24-33(5)12-11-25(32(3,4)23(33)10-13-35(24,34)7)44-29-28(40)27(39)26(38)22(19-37)43-29/h8,21-29,37-40H,9-19H2,1-7H3,(H,41,42)/t21-,22+,23-,24+,25-,26+,27-,28+,29-,33-,34+,35+,36-/m0/s1
Reactome pathway
n/an/a 0.0950n/an/an/an/an/an/a
China Pharmaceutical University
Curated by ChEMBL
Assay Description
Inhibition of LPS-induced tissue factor procoagulant activity in human THP1 cells preincubated for 1 hr followed by LPS addition measured after 5 hrs...
Bioorg Med Chem Lett 27: 1026-1030 (2017)
Article DOI: 10.1016/j.bmcl.2016.12.066
BindingDB Entry DOI: 10.7270/Q2B27XJD